program: Orca
programVersion: 5.0.2
elementType: O O O C C C C C C C C C C C C C C C C C C C H H H H H H H H H H H H H H H H H H H H H H H H
charge: 0
multiplicity: 1
keywords: wb97x-d3
keywords: def2-TZVPP
keywords: def2/J RIJCOSX
keywords: DEFGRID2
keywords: scfconv7
keywords: smallprint printgap noloewdin
keywords: NOSOSCF
formula: C19H24O3
InChI: InChI=1/C19H24O3/c1-7-8-13-12(4)16(10-15(13)20)22-18(21)17-14(9-11(2)3)19(17,5)6/h1,9,14,16-17H,8,10H2,2-6H3
46 atoms
O  0.335956 -1.034659 -0.07436
O  -0.759658 -1.131687 1.880975
O  4.858463 -1.47666 -0.889923
C  -3.204875 -1.713254 -0.019246
C  -3.241469 -0.307078 0.471485
C  -1.969707 -0.836463 -0.160035
C  -3.234067 -2.841134 0.982415
C  -3.90238 -2.048975 -1.31636
C  -4.037364 0.745997 -0.210378
C  -0.771354 -1.022154 0.682196
C  -3.646751 2.006196 -0.405208
C  1.606865 -1.161223 0.562408
C  -4.53071 3.001224 -1.093912
C  -2.314158 2.532791 0.033904
C  2.552471 -1.984858 -0.302482
C  2.269953 0.190007 0.685327
C  3.497389 0.188812 0.152209
C  3.803965 -1.133751 -0.421104
C  1.57603 1.318425 1.355088
C  4.485941 1.315459 0.103469
C  3.992165 2.462725 -0.64736
C  3.572191 3.406576 -1.257906
H  -3.176406 -0.211481 1.553159
H  -1.759984 -0.504144 -1.170271
H  -2.724837 -3.724001 0.591215
H  -4.268955 -3.122823 1.185145
H  -2.770863 -2.578541 1.930172
H  -4.957519 -2.267811 -1.139656
H  -3.455468 -2.93265 -1.774564
H  -3.850218 -1.236668 -2.041194
H  -5.028595 0.457481 -0.549066
H  1.476404 -1.600985 1.554576
H  2.134459 -2.140259 -1.299355
H  2.781393 -2.967206 0.110522
H  -4.762021 3.842296 -0.435943
H  -4.03706 3.421435 -1.973839
H  -5.472408 2.559299 -1.416781
H  -1.687489 2.774121 -0.829047
H  -2.434283 3.460295 0.598166
H  -1.767772 1.833097 0.662733
H  1.131598 0.997683 2.29802
H  0.76131 1.688784 0.728024
H  2.241987 2.157734 1.543358
H  4.748352 1.633741 1.116965
H  5.410893 0.952509 -0.351456
H  3.208362 4.241603 -1.806037
totalener: -964.14920211 hartree
nucrepener: 1780.09349501 hartree
electener: -2744.24269711 hartree
oneelecener: -4844.67545077 hartree
twoeener: 2100.43275366 hartree
kineticenergy: 959.81820020 hartree
xcener: -94.697518344373 hartree
chargesum: -0.0000000
charge: -0.269829 -0.388860 -0.329179 0.125787 -0.011908 -0.117692 -0.260161 -0.272060 -0.247678 0.311243 0.001803 0.213196 -0.211473 -0.221212 -0.135097 -0.024599 -0.062902 0.220060 -0.262752 -0.158933 -0.412988 0.090006 0.107344 0.089127 0.086217 0.085355 0.101785 0.090925 0.091883 0.086700 0.093549 0.099682 0.091336 0.088621 0.088290 0.085000 0.079620 0.097654 0.092834 0.062469 0.123714 0.101383 0.098875 0.118511 0.119152 0.245199
qa: -0.2698 -0.3889 -0.3292 0.1258 -0.0119 -0.1177 -0.2602 -0.2721 -0.2477 0.3112 0.0018 0.2132 -0.2115 -0.2212 -0.1351 -0.0246 -0.0629 0.2201 -0.2628 -0.1589 -0.4130 0.0900 0.1073 0.0891 0.0862 0.0854 0.1018 0.0909 0.0919 0.0867 0.0935 0.0997 0.0913 0.0886 0.0883 0.0850 0.0796 0.0977 0.0928 0.0625 0.1237 0.1014 0.0989 0.1185 0.1192 0.2452
va: 2.1174 2.1061 2.1736 3.7345 3.8071 3.8186 3.9057 3.9098 3.9065 4.2282 3.7306 3.7849 3.9441 3.9385 3.8743 3.6595 3.4953 4.1086 3.9458 3.9165 3.8626 3.5768 1.0259 1.0326 1.0019 1.0026 1.0196 1.0016 1.0065 1.0046 1.0102 1.0300 1.0317 1.0279 0.9987 0.9986 1.0097 0.9974 1.0041 1.0166 1.0085 1.0014 1.0058 0.9855 1.0197 0.9731
dispcorr: -0.022584635 hartree
energy: -964.171786742625
dipole: -26.48233 25.13959 -1.34274 6.41504 -5.84969 0.56535 -1.15060 1.22314 0.07254
magnitude: 1.45871 au
magnitude: 3.70776 debye
