program: Orca
programVersion: 5.0.2
elementType: O O O C C C C C C C C C C C C C C C C C C C C C C C H H H H H H H H H H H H H H H H H H H H H H H H H H
charge: 0
multiplicity: 1
keywords: wb97x-d3
keywords: def2-TZVPP
keywords: def2/J RIJCOSX
keywords: DEFGRID2
keywords: scfconv7
keywords: smallprint printgap noloewdin
keywords: NOSOSCF
formula: C23H26O3
InChI: InChI=1/C23H26O3/c1-16(2)13-20-21(23(20,3)4)22(24)25-15-17-9-8-12-19(14-17)26-18-10-6-5-7-11-18/h5-14,20-21H,15H2,1-4H3
52 atoms
O  -1.806064 0.558834 -1.228669
O  -2.733381 2.517563 -0.708268
O  3.127986 1.190705 0.580051
C  -3.954362 -0.822681 0.372604
C  -2.903545 -0.487526 1.37989
C  -3.44919 0.60874 0.471651
C  -5.359336 -1.018047 0.894084
C  -3.655812 -1.700311 -0.818599
C  -1.489578 -0.936794 1.301012
C  -2.639539 1.320539 -0.532491
C  -1.073005 -2.199079 1.427577
C  0.38538 -2.53725 1.362708
C  -1.988339 -3.363389 1.644375
C  -0.950014 1.189248 -2.190361
C  0.20379 1.900408 -1.541621
C  1.114527 1.174211 -0.777028
C  0.37787 3.267085 -1.714458
C  2.204655 1.820054 -0.211199
C  1.466856 3.904191 -1.134676
C  2.385382 3.187317 -0.387247
C  3.432059 -0.137405 0.417451
C  3.682629 -0.863754 1.573526
C  3.557013 -0.731003 -0.832829
C  4.047651 -2.198902 1.47731
C  3.908272 -2.071019 -0.91274
C  4.151163 -2.811886 0.236363
H  -3.275304 -0.379055 2.396616
H  -4.134005 1.29472 0.956141
H  -5.577271 -0.361808 1.737225
H  -5.500397 -2.048147 1.228066
H  -6.097481 -0.817998 0.115066
H  -4.191003 -1.351721 -1.703706
H  -4.006392 -2.712428 -0.609532
H  -2.6004 -1.769758 -1.063769
H  -0.735345 -0.163464 1.189041
H  0.725574 -3.004136 2.290566
H  1.000747 -1.656378 1.182127
H  0.583919 -3.257087 0.564488
H  -3.035588 -3.078451 1.728435
H  -1.713379 -3.895156 2.558991
H  -1.897797 -4.087313 0.830772
H  -1.518677 1.865979 -2.829239
H  -0.592681 0.367145 -2.808876
H  0.96951 0.109005 -0.640182
H  -0.33284 3.832416 -2.303532
H  1.6041 4.969241 -1.266317
H  3.237902 3.680833 0.061641
H  3.590466 -0.386793 2.541071
H  3.384264 -0.165061 -1.739147
H  4.241791 -2.76191 2.380771
H  3.998499 -2.534679 -1.886306
H  4.425956 -3.855581 0.163695
elementType: O C H
totalener: -1117.84969728 hartree
nucrepener: 2340.29396800 hartree
electener: -3458.14366527 hartree
oneelecener: -6170.16023998 hartree
twoeener: 2712.01657471 hartree
cpcmener: -0.03181491 hartree
kineticenergy: 1112.80553719 hartree
xcener: -110.232590699493 hartree
chargesum: -0.0000000
charge: -0.273783 -0.506970 -0.338521 0.092499 0.002505 -0.115805 -0.275148 -0.290452 -0.289346 0.431227 -0.024601 -0.207305 -0.265584 0.067441 0.035958 -0.303315 -0.214938 0.354010 -0.111731 -0.272190 0.318705 -0.248861 -0.215877 -0.138001 -0.136388 -0.186262 0.115141 0.094179 0.088959 0.091364 0.098520 0.114076 0.094259 0.097482 0.139663 0.107129 0.046411 0.097602 0.092904 0.108917 0.101852 0.118745 0.121524 0.146036 0.144508 0.159973 0.147351 0.145025 0.157977 0.159854 0.162554 0.160731
qa: -0.2738 -0.5070 -0.3385 0.0925 0.0025 -0.1158 -0.2751 -0.2905 -0.2893 0.4312 -0.0246 -0.2073 -0.2656 0.0674 0.0360 -0.3033 -0.2149 0.3540 -0.1117 -0.2722 0.3187 -0.2489 -0.2159 -0.1380 -0.1364 -0.1863 0.1151 0.0942 0.0890 0.0914 0.0985 0.1141 0.0943 0.0975 0.1397 0.1071 0.0464 0.0976 0.0929 0.1089 0.1019 0.1187 0.1215 0.1460 0.1445 0.1600 0.1474 0.1450 0.1580 0.1599 0.1626 0.1607
va: 2.1104 1.9955 2.0720 3.6826 3.7889 3.8640 3.9121 3.8767 3.8466 4.1199 3.7396 3.9377 3.9346 3.8153 3.6336 3.9282 3.9482 3.6426 3.8917 4.0071 3.6143 3.9440 3.9051 3.8478 3.8713 3.8786 1.0052 1.0269 1.0056 1.0035 1.0003 1.0028 0.9984 1.0101 0.9873 0.9978 1.0108 0.9982 1.0049 1.0001 0.9958 1.0065 0.9977 0.9923 1.0068 0.9883 1.0072 1.0096 0.9959 0.9898 0.9886 0.9900
dispcorr: -0.029358551 hartree
energy: -1117.879055827514
dipole: -16.48053 16.59767 0.11714 -20.99889 18.98291 -2.01597 4.63672 -4.93863 -0.30191
magnitude: 2.04182 au
magnitude: 5.18989 debye
