program: Orca
programVersion: 5.0.2
elementType: O O O C C C C C C C C C C C C C C C C C C C C C C C H H H H H H H H H H H H H H H H H H H H H H H H H H
charge: 0
multiplicity: 1
keywords: wb97x-d3
keywords: def2-TZVPP
keywords: def2/J RIJCOSX
keywords: DEFGRID2
keywords: scfconv7
keywords: smallprint printgap noloewdin
keywords: NOSOSCF
formula: C23H26O3
InChI: InChI=1/C23H26O3/c1-16(2)13-20-21(23(20,3)4)22(24)25-15-17-9-8-12-19(14-17)26-18-10-6-5-7-11-18/h5-14,20-21H,15H2,1-4H3
52 atoms
O  -1.372521 1.366204 -1.396595
O  -1.546623 1.409439 0.830783
O  3.601382 0.730477 -0.338925
C  -1.492711 -1.732021 0.296385
C  -2.906983 -1.37688 0.636856
C  -2.157572 -0.562069 -0.412899
C  -1.273217 -2.953371 -0.56237
C  -0.371799 -1.493833 1.275643
C  -3.323249 -0.850931 1.950974
C  -1.682364 0.816243 -0.214157
C  -4.452176 -1.164408 2.599092
C  -4.744203 -0.566694 3.943791
C  -5.516805 -2.094478 2.100796
C  -0.844538 2.685117 -1.416092
C  0.641065 2.75061 -1.170786
C  1.407374 1.630959 -0.870001
C  1.250999 3.997975 -1.276907
C  2.779662 1.768746 -0.683276
C  2.617518 4.119887 -1.087127
C  3.392681 3.008591 -0.794144
C  3.230517 -0.578415 -0.533429
C  2.79294 -1.041838 -1.768055
C  3.382343 -1.445695 0.538082
C  2.49159 -2.388012 -1.915785
C  3.092483 -2.79335 0.371739
C  2.638984 -3.267939 -0.850491
H  -3.638207 -2.022792 0.164374
H  -2.446401 -0.768847 -1.436658
H  -0.35519 -2.858431 -1.145708
H  -2.096875 -3.114687 -1.258605
H  -1.181376 -3.846679 0.058465
H  0.562093 -1.302219 0.743873
H  -0.222356 -2.388181 1.883332
H  -0.539162 -0.664491 1.957617
H  -2.651085 -0.163112 2.448042
H  -5.699219 -0.034944 3.936742
H  -3.971296 0.132741 4.261958
H  -4.831406 -1.344002 4.707653
H  -6.45245 -1.551453 1.937813
H  -5.733257 -2.858473 2.851837
H  -5.266017 -2.606463 1.173268
H  -1.3740 3.329034 -0.710529
H  -1.061117 3.060401 -2.416426
H  0.95229 0.652995 -0.785426
H  0.656315 4.872203 -1.512873
H  3.089783 5.089429 -1.174512
H  4.461261 3.101036 -0.648471
H  2.689308 -0.366364 -2.60783
H  3.728391 -1.070692 1.492793
H  2.145484 -2.750268 -2.874869
H  3.212427 -3.469579 1.207831
H  2.404022 -4.316474 -0.975521
elementType: O C H
totalener: -1117.85329104 hartree
nucrepener: 2315.51080591 hartree
electener: -3433.36409696 hartree
oneelecener: -6120.94099683 hartree
twoeener: 2687.57689987 hartree
cpcmener: -0.03129821 hartree
kineticenergy: 1112.77445688 hartree
xcener: -110.230080717389 hartree
chargesum: 0.0000000
charge: -0.297729 -0.484165 -0.335526 0.156886 0.015339 -0.073545 -0.286481 -0.252681 -0.303770 0.377665 -0.055237 -0.220949 -0.258138 0.084384 0.007626 -0.229343 -0.260371 0.354929 -0.102107 -0.283090 0.307863 -0.214682 -0.224660 -0.132916 -0.126350 -0.200752 0.122320 0.097736 0.090140 0.095827 0.099553 0.022561 0.109237 0.104141 0.118260 0.092721 0.088470 0.094116 0.099204 0.094868 0.090546 0.118245 0.132601 0.128880 0.144531 0.159407 0.145660 0.159514 0.144656 0.163172 0.159923 0.161509
qa: -0.2977 -0.4842 -0.3355 0.1569 0.0153 -0.0735 -0.2865 -0.2527 -0.3038 0.3777 -0.0552 -0.2209 -0.2581 0.0844 0.0076 -0.2293 -0.2604 0.3549 -0.1021 -0.2831 0.3079 -0.2147 -0.2247 -0.1329 -0.1263 -0.2008 0.1223 0.0977 0.0901 0.0958 0.0996 0.0226 0.1092 0.1041 0.1183 0.0927 0.0885 0.0941 0.0992 0.0949 0.0905 0.1182 0.1326 0.1289 0.1445 0.1594 0.1457 0.1595 0.1447 0.1632 0.1599 0.1615
va: 2.1136 1.9979 2.0801 3.6268 3.7514 3.8267 3.9091 3.8881 3.8525 4.1216 3.7837 3.9215 3.9384 3.8235 3.6998 3.9196 3.9799 3.6569 3.8781 3.9989 3.6234 3.9038 3.9451 3.8091 3.8231 3.8426 1.0007 1.0305 1.0068 1.0084 1.0004 1.0329 1.0019 1.0204 1.0281 0.9957 1.0090 0.9964 0.9959 0.9970 1.0135 1.0120 0.9913 1.0022 0.9998 0.9879 1.0095 0.9943 1.0080 0.9890 0.9890 0.9900
dispcorr: -0.027647490 hartree
energy: -1117.880938532541
dipole: -22.04663 21.37026 -0.67637 -15.88166 14.89589 -0.98577 10.65195 -11.73459 -1.08264
magnitude: 1.61286 au
magnitude: 4.09958 debye
