program: Orca
programVersion: 5.0.2
elementType: O O O C C C C C C C C C C C C C C C C C C C C C C C H H H H H H H H H H H H H H H H H H H H H H H H H H
charge: 0
multiplicity: 1
keywords: wb97x-d3
keywords: def2-TZVPP
keywords: def2/J RIJCOSX
keywords: DEFGRID2
keywords: scfconv7
keywords: smallprint printgap noloewdin
keywords: NOSOSCF
formula: C23H26O3
InChI: InChI=1/C23H26O3/c1-16(2)13-20-21(23(20,3)4)22(24)25-15-17-9-8-12-19(14-17)26-18-10-6-5-7-11-18/h5-14,20-21H,15H2,1-4H3
52 atoms
O  -1.785092 1.717474 -1.235955
O  -1.320188 -0.434534 -1.644681
O  3.562668 1.310169 -0.529182
C  -3.82229 -0.916968 0.191421
C  -2.64931 -1.00132 1.117141
C  -2.776001 0.184303 0.167525
C  -5.151156 -0.525167 0.790666
C  -3.952641 -1.897498 -0.946007
C  -1.605776 -2.045428 0.999216
C  -1.885636 0.408849 -0.984883
C  -1.427938 -3.034157 1.881967
C  -0.341877 -4.049485 1.692726
C  -2.258673 -3.232503 3.112975
C  -0.942198 2.17714 -2.30411
C  0.372216 2.648706 -1.753188
C  1.355862 1.728134 -1.404057
C  0.602205 4.007144 -1.562594
C  2.547052 2.173873 -0.850134
C  1.806214 4.441648 -1.026844
C  2.780488 3.528207 -0.656015
C  3.283195 0.127634 0.108424
C  4.076849 -0.96254 -0.220195
C  2.300601 0.021104 1.085869
C  3.890239 -2.16695 0.442566
C  2.117603 -1.193775 1.731257
C  2.909375 -2.290638 1.416949
H  -2.871247 -0.708231 2.137966
H  -3.083839 1.105855 0.646774
H  -5.798149 -0.061692 0.043467
H  -5.033353 0.179256 1.614809
H  -5.668684 -1.405644 1.176715
H  -4.514514 -2.768743 -0.604122
H  -3.00299 -2.258403 -1.330928
H  -4.507603 -1.456626 -1.7760
H  -0.946976 -2.014939 0.140352
H  -0.759422 -5.05766 1.626457
H  0.343511 -4.056777 2.544812
H  0.242054 -3.866449 0.791165
H  -2.632985 -4.258334 3.157191
H  -3.118061 -2.567416 3.176233
H  -1.655959 -3.08811 4.014009
H  -1.481054 3.004176 -2.764115
H  -0.807502 1.401155 -3.056758
H  1.194509 0.670298 -1.571679
H  -0.159498 4.725667 -1.837992
H  1.984298 5.499144 -0.883445
H  3.717256 3.859964 -0.226769
H  4.83891 -0.864211 -0.982964
H  1.685142 0.870874 1.35231
H  4.513626 -3.014009 0.188247
H  1.352668 -1.276241 2.492492
H  2.764506 -3.232177 1.929198
elementType: O C H
totalener: -1117.85243576 hartree
nucrepener: 2307.52297116 hartree
electener: -3425.37540692 hartree
oneelecener: -6105.23608542 hartree
twoeener: 2679.86067850 hartree
cpcmener: -0.02839414 hartree
kineticenergy: 1112.79630348 hartree
xcener: -110.227584147543 hartree
chargesum: -0.0000000
charge: -0.294009 -0.504782 -0.342513 0.158003 0.006542 -0.133911 -0.271481 -0.288652 -0.322928 0.436117 -0.002160 -0.268884 -0.263429 0.084439 -0.023560 -0.153800 -0.219248 0.248411 -0.118697 -0.245771 0.301766 -0.260304 -0.188804 -0.118512 -0.156006 -0.206794 0.113296 0.098797 0.095392 0.089732 0.093712 0.097748 0.095449 0.104792 0.132847 0.111508 0.098564 0.093296 0.095925 0.089417 0.099989 0.116754 0.117337 0.149339 0.146416 0.161121 0.149239 0.147233 0.155714 0.161305 0.168177 0.165869
qa: -0.2940 -0.5048 -0.3425 0.1580 0.0065 -0.1339 -0.2715 -0.2887 -0.3229 0.4361 -0.0022 -0.2689 -0.2634 0.0844 -0.0236 -0.1538 -0.2192 0.2484 -0.1187 -0.2458 0.3018 -0.2603 -0.1888 -0.1185 -0.1560 -0.2068 0.1133 0.0988 0.0954 0.0897 0.0937 0.0977 0.0954 0.1048 0.1328 0.1115 0.0986 0.0933 0.0959 0.0894 0.1000 0.1168 0.1173 0.1493 0.1464 0.1611 0.1492 0.1472 0.1557 0.1613 0.1682 0.1659
va: 2.1260 1.9781 2.0614 3.6867 3.7523 3.9715 3.9064 3.9034 3.8326 4.0515 3.6550 3.9349 3.9490 3.8014 3.6962 3.8761 3.9686 3.7620 3.8866 4.0155 3.6627 4.0160 3.8892 3.8972 3.8457 3.8800 1.0023 1.0291 1.0023 1.0046 1.0024 1.0015 1.0135 0.9999 1.0184 1.0005 0.9894 1.0037 0.9975 1.0077 0.9968 0.9994 1.0186 1.0196 1.0021 0.9876 1.0051 1.0079 0.9993 0.9881 0.9839 0.9857
dispcorr: -0.026835615 hartree
energy: -1117.879271374509
dipole: -21.84556 20.71701 -1.12855 -19.20122 19.62917 0.42795 11.62775 -10.75786 0.86988
magnitude: 1.48777 au
magnitude: 3.78161 debye
