program: Orca
programVersion: 5.0.2
elementType: O O O C C C C C C C C C C C C C C C C C C C C C C C H H H H H H H H H H H H H H H H H H H H H H H H H H
charge: 0
multiplicity: 1
keywords: wb97x-d3
keywords: def2-TZVPP
keywords: def2/J RIJCOSX
keywords: DEFGRID2
keywords: scfconv7
keywords: smallprint printgap noloewdin
keywords: NOSOSCF
formula: C23H26O3
InChI: InChI=1/C23H26O3/c1-16(2)13-20-21(23(20,3)4)22(24)25-15-17-9-8-12-19(14-17)26-18-10-6-5-7-11-18/h5-14,20-21H,15H2,1-4H3
52 atoms
O  -1.477518 2.121927 0.941107
O  -2.162927 1.230129 -0.983536
O  3.320425 0.944602 -0.43108
C  -3.52717 -0.94679 0.778072
C  -2.122598 -1.453507 0.676104
C  -2.383608 0.001235 1.07688
C  -4.325073 -1.372163 1.987729
C  -4.373558 -0.809195 -0.462862
C  -1.490569 -1.822601 -0.607774
C  -2.021261 1.138779 0.214857
C  -0.995331 -3.028364 -0.908334
C  -0.342325 -3.274622 -2.234717
C  -1.029388 -4.220952 -0.00269
C  -0.974855 3.256897 0.232653
C  0.224875 2.91477 -0.606147
C  1.210361 2.077021 -0.094793
C  0.361028 3.445566 -1.882504
C  2.307079 1.749554 -0.879218
C  1.481729 3.140672 -2.642475
C  2.452802 2.28149 -2.154275
C  3.068102 -0.078154 0.449562
C  4.004844 -0.287223 1.452237
C  1.966312 -0.916114 0.322091
C  3.837231 -1.345677 2.334648
C  1.803884 -1.959268 1.221975
C  2.733918 -2.181226 2.229064
H  -1.797306 -2.044628 1.525549
H  -2.221297 0.201346 2.129281
H  -5.105076 -0.643442 2.21633
H  -3.697305 -1.47897 2.87281
H  -4.810733 -2.332731 1.805958
H  -5.101552 -0.003568 -0.351723
H  -4.932872 -1.734474 -0.612551
H  -3.80766 -0.626384 -1.37123
H  -1.425239 -1.057058 -1.371698
H  -0.371954 -2.396653 -2.879137
H  -0.823133 -4.101015 -2.764229
H  0.704633 -3.560712 -2.10316
H  -1.43402 -4.013206 0.985729
H  -0.028508 -4.640583 0.123543
H  -1.6389 -5.013104 -0.445539
H  -0.708874 3.9688 1.013446
H  -1.75766 3.711694 -0.377079
H  1.117483 1.679144 0.908264
H  -0.409871 4.091218 -2.28416
H  1.589802 3.556129 -3.635687
H  3.316968 2.023984 -2.753276
H  4.860395 0.371016 1.536507
H  1.237849 -0.76657 -0.465691
H  4.571224 -1.509047 3.112822
H  0.941281 -2.605297 1.126397
H  2.599088 -2.999741 2.923232
elementType: O C H
totalener: -1117.85348255 hartree
nucrepener: 2358.98251455 hartree
electener: -3476.83599710 hartree
oneelecener: -6207.98090619 hartree
twoeener: 2731.14490909 hartree
cpcmener: -0.02937008 hartree
kineticenergy: 1112.80213637 hartree
xcener: -110.232747656084 hartree
chargesum: 0.0000000
charge: -0.300986 -0.492279 -0.340485 0.149011 0.005321 -0.098214 -0.266452 -0.291650 -0.350145 0.404281 -0.010335 -0.237094 -0.269386 0.105467 0.037639 -0.259523 -0.240483 0.308052 -0.106257 -0.273157 0.315230 -0.272862 -0.248491 -0.096165 -0.067151 -0.254753 0.114988 0.099259 0.095511 0.089067 0.094290 0.105247 0.096596 0.095773 0.131460 0.091350 0.101439 0.093261 0.095862 0.094339 0.113333 0.123358 0.116685 0.141047 0.145266 0.160919 0.148548 0.147552 0.165194 0.160475 0.173251 0.156795
qa: -0.3010 -0.4923 -0.3405 0.1490 0.0053 -0.0982 -0.2665 -0.2916 -0.3501 0.4043 -0.0103 -0.2371 -0.2694 0.1055 0.0376 -0.2595 -0.2405 0.3081 -0.1063 -0.2732 0.3152 -0.2729 -0.2485 -0.0962 -0.0672 -0.2548 0.1150 0.0993 0.0955 0.0891 0.0943 0.1052 0.0966 0.0958 0.1315 0.0914 0.1014 0.0933 0.0959 0.0943 0.1133 0.1234 0.1167 0.1410 0.1453 0.1609 0.1485 0.1476 0.1652 0.1605 0.1733 0.1568
va: 2.1107 1.9933 2.0750 3.7541 3.7170 3.9292 3.9039 3.9033 3.7939 4.0636 3.6984 3.9172 3.9252 3.7957 3.6112 3.9242 3.9707 3.6907 3.8815 4.0143 3.7184 4.0216 3.9315 3.8543 3.7690 3.9983 1.0027 1.0284 1.0020 1.0048 1.0022 1.0000 1.0014 1.0135 1.0189 1.0075 0.9977 0.9959 1.0090 0.9956 0.9975 0.9934 1.0088 1.0179 1.0026 0.9876 1.0064 1.0075 0.9917 0.9873 0.9697 0.9953
dispcorr: -0.028334589 hartree
energy: -1117.881817143074
dipole: -17.81642 17.38811 -0.42831 -20.66694 20.11955 -0.54739 0.85288 0.34703 1.19991
magnitude: 1.38668 au
magnitude: 3.52466 debye
