program: Orca
programVersion: 5.0.2
elementType: O O O C C C C C C C C C C C C C C C C C C C C C C C H H H H H H H H H H H H H H H H H H H H H H H H H H
charge: 0
multiplicity: 1
keywords: wb97x-d3
keywords: def2-TZVPP
keywords: def2/J RIJCOSX
keywords: DEFGRID2
keywords: scfconv7
keywords: smallprint printgap noloewdin
keywords: NOSOSCF
formula: C23H26O3
InChI: InChI=1/C23H26O3/c1-16(2)13-20-21(23(20,3)4)22(24)25-15-17-9-8-12-19(14-17)26-18-10-6-5-7-11-18/h5-14,20-21H,15H2,1-4H3
52 atoms
O  -2.413463 1.857578 -1.507493
O  -2.000116 -0.31759 -1.786083
O  3.218062 0.19306 -1.448753
C  -4.515132 -0.89619 -0.084749
C  -3.720387 -0.135447 0.938008
C  -3.894267 0.412134 -0.489187
C  -6.018218 -0.843361 0.069909
C  -4.041751 -2.230366 -0.609972
C  -2.394134 -0.565215 1.417816
C  -2.692294 0.561972 -1.328593
C  -1.881255 -0.345138 2.634346
C  -0.499663 -0.820705 2.972098
C  -2.574182 0.376418 3.749629
C  -1.15131 2.176091 -2.09957
C  -0.008396 1.822274 -1.18838
C  1.084239 1.129019 -1.688056
C  -0.035101 2.188115 0.155472
C  2.157112 0.825752 -0.858889
C  1.035419 1.869063 0.975538
C  2.142302 1.19308 0.479602
C  4.033755 -0.624268 -0.702937
C  3.515696 -1.638239 0.093217
C  5.402975 -0.443103 -0.823685
C  4.388403 -2.472495 0.776209
C  6.265007 -1.293206 -0.143809
C  5.76294 -2.305918 0.661144
H  -4.315799 0.410729 1.660032
H  -4.568669 1.258947 -0.553335
H  -6.355372 0.120011 0.454544
H  -6.36192 -1.616354 0.759508
H  -6.512206 -1.009685 -0.889461
H  -2.964914 -2.366821 -0.597611
H  -4.385455 -2.385583 -1.633896
H  -4.475008 -3.023747 0.001873
H  -1.76525 -1.099918 0.714216
H  0.120453 0.004551 3.331932
H  0.005402 -1.272453 2.118121
H  -0.52553 -1.558023 3.779095
H  -2.061998 1.317063 3.971016
H  -2.53752 -0.216181 4.667246
H  -3.618392 0.608097 3.548572
H  -1.191317 3.252655 -2.263477
H  -1.04225 1.696307 -3.073819
H  1.107283 0.822135 -2.727109
H  -0.882385 2.723334 0.564562
H  1.01905 2.157739 2.018328
H  2.97397 0.967509 1.134074
H  2.445528 -1.780318 0.180456
H  5.79052 0.351099 -1.449036
H  3.988087 -3.263254 1.396949
H  7.333777 -1.15475 -0.241054
H  6.437007 -2.963452 1.193679
elementType: O C H
totalener: -1117.85243057 hartree
nucrepener: 2285.48320138 hartree
electener: -3403.33563195 hartree
oneelecener: -6061.32772414 hartree
twoeener: 2657.99209219 hartree
cpcmener: -0.03182145 hartree
kineticenergy: 1112.79650275 hartree
xcener: -110.228826075607 hartree
chargesum: -0.0000000
charge: -0.291542 -0.480302 -0.339765 0.120666 0.045481 -0.103213 -0.268324 -0.282017 -0.321832 0.391474 -0.051381 -0.230763 -0.257981 0.096955 0.055050 -0.264512 -0.273347 0.302292 -0.163233 -0.193333 0.266599 -0.183395 -0.232663 -0.156761 -0.134773 -0.176989 0.116272 0.102413 0.088019 0.095949 0.094404 0.090599 0.102454 0.093880 0.124088 0.089319 0.088497 0.112996 0.099818 0.096759 0.090592 0.125476 0.116670 0.133434 0.143860 0.167459 0.156093 0.164179 0.148852 0.162554 0.161200 0.161773
qa: -0.2915 -0.4803 -0.3398 0.1207 0.0455 -0.1032 -0.2683 -0.2820 -0.3218 0.3915 -0.0514 -0.2308 -0.2580 0.0970 0.0551 -0.2645 -0.2733 0.3023 -0.1632 -0.1933 0.2666 -0.1834 -0.2327 -0.1568 -0.1348 -0.1770 0.1163 0.1024 0.0880 0.0959 0.0944 0.0906 0.1025 0.0939 0.1241 0.0893 0.0885 0.1130 0.0998 0.0968 0.0906 0.1255 0.1167 0.1334 0.1439 0.1675 0.1561 0.1642 0.1489 0.1626 0.1612 0.1618
va: 2.1075 2.0177 2.0619 3.7178 3.7321 3.8236 3.9061 3.8908 3.8395 4.1470 3.7495 3.9214 3.9386 3.7886 3.6027 4.0731 3.9092 3.7051 3.8550 3.8725 3.6871 3.9105 4.0006 3.8945 3.8820 3.8909 1.0012 1.0276 1.0045 1.0019 1.0021 1.0120 0.9999 1.0014 1.0139 0.9944 1.0084 0.9981 0.9964 0.9971 1.0129 0.9931 1.0095 1.0197 1.0133 0.9855 0.9983 0.9929 1.0062 0.9896 0.9883 0.9889
dispcorr: -0.026806905 hartree
energy: -1117.879237470965
dipole: -20.05316 19.61251 -0.44065 -7.14348 7.79004 0.64655 16.79101 -15.36848 1.42253
magnitude: 1.62351 au
magnitude: 4.12665 debye
