program: Orca
programVersion: 5.0.2
elementType: O O O C C C C C C C C C C C C C C C C C C C C C C C H H H H H H H H H H H H H H H H H H H H H H H H H H
charge: 0
multiplicity: 1
keywords: wb97x-d3
keywords: def2-TZVPP
keywords: def2/J RIJCOSX
keywords: DEFGRID2
keywords: scfconv7
keywords: smallprint printgap noloewdin
keywords: NOSOSCF
formula: C23H26O3
InChI: InChI=1/C23H26O3/c1-16(2)13-20-21(23(20,3)4)22(24)25-15-17-9-8-12-19(14-17)26-18-10-6-5-7-11-18/h5-14,20-21H,15H2,1-4H3
52 atoms
O  -1.387687 1.209711 -0.977255
O  -1.297011 0.851664 1.225493
O  3.66332 0.722005 -1.324804
C  -1.652902 -2.157033 0.53189
C  -3.046605 -1.63727 0.539154
C  -1.971286 -0.90721 -0.269872
C  -1.364853 -3.37773 -0.310041
C  -0.806463 -2.097833 1.779542
C  -3.669536 -1.039233 1.746824
C  -1.52143 0.437878 0.111327
C  -4.571269 -0.054399 1.728068
C  -5.181206 0.4746 2.989147
C  -5.021521 0.621119 0.469028
C  -0.888216 2.52942 -0.793236
C  0.593585 2.564234 -0.534614
C  1.431378 1.566187 -1.017378
C  1.139827 3.655635 0.134138
C  2.802628 1.666565 -0.821515
C  2.512336 3.751263 0.305406
C  3.355465 2.754806 -0.164756
C  3.347888 -0.607156 -1.16635
C  2.969171 -1.11699 0.069615
C  3.47296 -1.436606 -2.270557
C  2.720986 -2.476503 0.19189
C  3.22304 -2.795536 -2.132773
C  2.842791 -3.319896 -0.90534
H  -3.739843 -2.164693 -0.111651
H  -2.034845 -1.053635 -1.341451
H  -1.567362 -4.289217 0.255487
H  -0.316102 -3.401922 -0.614034
H  -1.975212 -3.404325 -1.213504
H  -0.900774 -3.041821 2.319684
H  -1.079633 -1.302725 2.466863
H  0.246683 -1.971669 1.524251
H  -3.384746 -1.461961 2.706085
H  -4.778106 -0.010726 3.877601
H  -6.265047 0.335144 2.988727
H  -5.009585 1.549964 3.083039
H  -4.723236 0.092245 -0.434142
H  -4.613265 1.63417 0.41166
H  -6.108358 0.727018 0.452766
H  -1.430589 3.049685 -0.001305
H  -1.111116 3.042887 -1.729196
H  1.026885 0.716205 -1.553749
H  0.490923 4.432705 0.519052
H  2.932354 4.602611 0.824598
H  4.426512 2.82022 -0.023243
H  2.879409 -0.467779 0.931826
H  3.766439 -1.023503 -3.227146
H  2.43581 -2.878209 1.155293
H  3.319647 -3.443338 -2.994015
H  2.647021 -4.378663 -0.801323
elementType: O C H
totalener: -1117.85281076 hartree
nucrepener: 2331.11862460 hartree
electener: -3448.97143536 hartree
oneelecener: -6152.52325598 hartree
twoeener: 2703.55182062 hartree
cpcmener: -0.03227453 hartree
kineticenergy: 1112.80122698 hartree
xcener: -110.229621326282 hartree
chargesum: -0.0000000
charge: -0.309140 -0.490694 -0.348889 0.140969 -0.018791 -0.079572 -0.262305 -0.299380 -0.298068 0.396147 -0.012747 -0.224245 -0.270274 0.105928 0.014762 -0.181700 -0.229510 0.225179 -0.122524 -0.238954 0.252694 -0.151323 -0.234145 -0.194275 -0.123482 -0.178090 0.115363 0.095624 0.095196 0.087563 0.090338 0.102927 0.097282 0.090423 0.124403 0.089577 0.096762 0.094938 0.097481 0.101442 0.106546 0.114912 0.125011 0.145196 0.145546 0.160485 0.149616 0.159833 0.149023 0.171922 0.161922 0.163096
qa: -0.3091 -0.4907 -0.3489 0.1410 -0.0188 -0.0796 -0.2623 -0.2994 -0.2981 0.3961 -0.0127 -0.2242 -0.2703 0.1059 0.0148 -0.1817 -0.2295 0.2252 -0.1225 -0.2390 0.2527 -0.1513 -0.2341 -0.1943 -0.1235 -0.1781 0.1154 0.0956 0.0952 0.0876 0.0903 0.1029 0.0973 0.0904 0.1244 0.0896 0.0968 0.0949 0.0975 0.1014 0.1065 0.1149 0.1250 0.1452 0.1455 0.1605 0.1496 0.1598 0.1490 0.1719 0.1619 0.1631
va: 2.0926 1.9892 2.0442 3.7140 3.8534 3.8041 3.9036 3.8872 3.8575 4.0442 3.6973 3.9257 3.9496 3.7953 3.6373 3.8926 3.9658 3.7511 3.8922 4.0060 3.7062 3.8502 4.0018 3.8570 3.8803 3.8485 1.0044 1.0310 1.0024 1.0051 1.0055 0.9997 1.0180 1.0124 1.0014 1.0068 0.9966 0.9960 1.0042 0.9974 1.0000 1.0125 0.9911 1.0185 1.0013 0.9878 1.0048 0.9971 1.0063 0.9812 0.9870 0.9892
dispcorr: -0.027704638 hartree
energy: -1117.880515395995
dipole: -23.25864 22.34706 -0.91158 -10.34963 9.91371 -0.43593 9.23035 -9.89410 -0.66375
magnitude: 1.20896 au
magnitude: 3.07292 debye
