program: Orca
programVersion: 5.0.2
elementType: O O O C C C C C C C C C C C C C C C C C C C C C C C H H H H H H H H H H H H H H H H H H H H H H H H H H
charge: 0
multiplicity: 1
keywords: wb97x-d3
keywords: def2-TZVPP
keywords: def2/J RIJCOSX
keywords: DEFGRID2
keywords: scfconv7
keywords: smallprint printgap noloewdin
keywords: NOSOSCF
formula: C23H26O3
InChI: InChI=1/C23H26O3/c1-16(2)13-20-21(23(20,3)4)22(24)25-15-17-9-8-12-19(14-17)26-18-10-6-5-7-11-18/h5-14,20-21H,15H2,1-4H3
52 atoms
O  -1.985852 1.447939 -1.364178
O  -1.550981 -0.747252 -1.499245
O  2.848288 1.111557 0.945271
C  -4.29392 -1.123171 -0.071949
C  -3.297751 -0.958749 1.021268
C  -3.343281 0.058922 -0.124574
C  -5.726688 -0.753698 0.233348
C  -4.185159 -2.267881 -1.048338
C  -2.157853 -1.890682 1.204414
C  -2.213106 0.164617 -1.057565
C  -0.991926 -1.566758 1.769535
C  0.097774 -2.578838 1.943744
C  -0.673689 -0.189044 2.263433
C  -0.881384 1.789325 -2.212812
C  0.270923 2.296713 -1.393361
C  1.035244 1.418257 -0.628449
C  0.565644 3.655352 -1.381665
C  2.091876 1.907754 0.125827
C  1.619895 4.133847 -0.616663
C  2.391004 3.264125 0.136023
C  3.248498 -0.142661 0.56814
C  3.487014 -0.502949 -0.752834
C  3.476453 -1.045183 1.599307
C  3.935072 -1.786978 -1.031956
C  3.939205 -2.318714 1.304948
C  4.162692 -2.699724 -0.011387
H  -3.686439 -0.532627 1.942419
H  -3.786785 1.013726 0.13124
H  -6.254942 -1.601024 0.674312
H  -6.258343 -0.468506 -0.6763
H  -5.791993 0.079635 0.933635
H  -4.621785 -1.993397 -2.009927
H  -4.74968 -3.120596 -0.66645
H  -3.169524 -2.606521 -1.229518
H  -2.30448 -2.916012 0.877566
H  0.962265 -2.32372 1.325682
H  -0.22553 -3.583391 1.671838
H  0.454918 -2.60349 2.97632
H  -1.345907 0.573487 1.874361
H  0.346876 0.095513 2.001807
H  -0.729297 -0.149746 3.35422
H  -1.247203 2.574731 -2.872272
H  -0.588355 0.941831 -2.83161
H  0.808407 0.35912 -0.630154
H  -0.030132 4.339768 -1.972368
H  1.847216 5.191499 -0.6090
H  3.217649 3.629902 0.73159
H  3.331077 0.198423 -1.562029
H  3.293136 -0.74844 2.624339
H  4.113607 -2.068921 -2.061337
H  4.115876 -3.018035 2.111547
H  4.5141 -3.696952 -0.239688
elementType: O C H
totalener: -1117.85198974 hartree
nucrepener: 2343.62623155 hartree
electener: -3461.47822129 hartree
oneelecener: -6177.52486211 hartree
twoeener: 2716.04664081 hartree
cpcmener: -0.02935600 hartree
kineticenergy: 1112.80699279 hartree
xcener: -110.231331178770 hartree
chargesum: -0.0000000
charge: -0.297714 -0.497961 -0.342503 0.132367 -0.011919 -0.116745 -0.265998 -0.301919 -0.279730 0.420419 -0.002838 -0.220878 -0.270586 0.078570 -0.001557 -0.230991 -0.222715 0.332486 -0.108424 -0.270788 0.351718 -0.230080 -0.297749 -0.142026 -0.113676 -0.187587 0.116846 0.095831 0.094417 0.096093 0.088192 0.102637 0.100081 0.093536 0.125680 0.072361 0.096805 0.100601 0.097887 0.069537 0.121783 0.115215 0.118077 0.151803 0.145145 0.161326 0.148197 0.158150 0.144500 0.162517 0.160456 0.161147
qa: -0.2977 -0.4980 -0.3425 0.1324 -0.0119 -0.1167 -0.2660 -0.3019 -0.2797 0.4204 -0.0028 -0.2209 -0.2706 0.0786 -0.0016 -0.2310 -0.2227 0.3325 -0.1084 -0.2708 0.3517 -0.2301 -0.2977 -0.1420 -0.1137 -0.1876 0.1168 0.0958 0.0944 0.0961 0.0882 0.1026 0.1001 0.0935 0.1257 0.0724 0.0968 0.1006 0.0979 0.0695 0.1218 0.1152 0.1181 0.1518 0.1451 0.1613 0.1482 0.1582 0.1445 0.1625 0.1605 0.1611
va: 2.1116 1.9837 2.0452 3.7427 3.8090 3.8483 3.8991 3.8956 3.8475 4.0697 3.6657 3.9240 3.9490 3.8090 3.7148 3.8920 3.9718 3.6150 3.8806 4.0453 3.5887 3.9089 3.9494 3.8871 3.8333 3.8995 1.0031 1.0321 1.0021 1.0021 1.0046 1.0000 0.9984 1.0156 1.0003 1.0027 1.0113 0.9955 1.0062 1.0058 0.9996 1.0001 1.0183 1.0084 1.0027 0.9875 1.0066 0.9971 1.0116 0.9889 0.9885 0.9889
dispcorr: -0.028858829 hartree
energy: -1117.880848568714
dipole: -16.81883 16.33194 -0.48689 -11.83453 12.51018 0.67565 5.66650 -5.61438 0.05212
magnitude: 0.83444 au
magnitude: 2.12097 debye
