program: Orca
programVersion: 5.0.2
elementType: O O O C C C C C C C C C C C C C C C C C C C C C C C H H H H H H H H H H H H H H H H H H H H H H H H H H
charge: 0
multiplicity: 1
keywords: wb97x-d3
keywords: def2-TZVPP
keywords: def2/J RIJCOSX
keywords: DEFGRID2
keywords: scfconv7
keywords: smallprint printgap noloewdin
keywords: NOSOSCF
formula: C23H26O3
InChI: InChI=1/C23H26O3/c1-16(2)13-20-21(23(20,3)4)22(24)25-15-17-9-8-12-19(14-17)26-18-10-6-5-7-11-18/h5-14,20-21H,15H2,1-4H3
52 atoms
O  -1.509717 2.192241 0.716064
O  -2.073065 1.050908 -1.115958
O  3.424062 1.127462 -0.292399
C  -3.588683 -0.826449 0.87467
C  -2.208721 -1.403726 0.841149
C  -2.39961 0.094639 1.071656
C  -4.406757 -1.076754 2.118673
C  -4.421831 -0.782696 -0.381422
C  -1.589478 -1.96513 -0.379179
C  -1.996476 1.114434 0.09043
C  -1.213346 -3.241169 -0.519837
C  -0.549202 -3.713613 -1.777453
C  -1.379907 -4.297617 0.529894
C  -1.012902 3.256726 -0.094326
C  0.252052 2.894159 -0.822134
C  1.234733 2.133256 -0.197635
C  0.461293 3.365976 -2.113036
C  2.407694 1.838162 -0.878718
C  1.649288 3.085265 -2.771898
C  2.626215 2.311039 -2.16489
C  3.138638 0.015273 0.460433
C  3.920599 -0.198565 1.58718
C  2.159349 -0.899918 0.092451
C  3.725123 -1.342427 2.348272
C  1.971841 -2.035392 0.86785
C  2.749742 -2.264191 1.994783
H  -1.915761 -1.902591 1.758772
H  -2.233933 0.406908 2.095731
H  -5.145747 -0.28713 2.267788
H  -3.783749 -1.124654 3.012364
H  -4.94434 -2.02331 2.036777
H  -3.841322 -0.714964 -1.29692
H  -5.115385 0.059635 -0.358304
H  -5.019094 -1.694275 -0.443753
H  -1.420135 -1.300155 -1.217308
H  -0.407565 -2.908258 -2.497823
H  -1.133766 -4.501676 -2.259173
H  0.430366 -4.147877 -1.55911
H  -0.406761 -4.611571 0.918871
H  -1.841228 -5.190518 0.101304
H  -1.99159 -3.985799 1.374143
H  -0.825295 4.068553 0.608436
H  -1.776247 3.599694 -0.79561
H  1.090213 1.773422 0.814176
H  -0.305521 3.952879 -2.603098
H  1.811069 3.456646 -3.775201
H  3.54832 2.076181 -2.680892
H  4.679169 0.523353 1.861861
H  1.548131 -0.741563 -0.787639
H  4.337989 -1.507399 3.224686
H  1.209626 -2.7482 0.581417
H  2.595695 -3.15323 2.591427
elementType: O C H
totalener: -1117.85330501 hartree
nucrepener: 2341.36434091 hartree
electener: -3459.21764592 hartree
oneelecener: -6172.81760029 hartree
twoeener: 2713.59995437 hartree
cpcmener: -0.02999584 hartree
kineticenergy: 1112.79453600 hartree
xcener: -110.229686029078 hartree
chargesum: -0.0000000
charge: -0.301819 -0.495130 -0.344752 0.159745 0.015046 -0.115668 -0.268598 -0.290895 -0.356306 0.414522 0.003508 -0.237954 -0.266675 0.108209 0.028924 -0.227604 -0.227362 0.265812 -0.117612 -0.254319 0.309400 -0.265514 -0.227746 -0.099242 -0.098113 -0.241489 0.113604 0.098866 0.095316 0.089578 0.093167 0.095719 0.105071 0.096661 0.130174 0.091577 0.104444 0.091910 0.095465 0.102511 0.092332 0.123496 0.116278 0.143702 0.145425 0.161216 0.149220 0.147189 0.154335 0.160582 0.176447 0.157348
qa: -0.3018 -0.4951 -0.3448 0.1597 0.0150 -0.1157 -0.2686 -0.2909 -0.3563 0.4145 0.0035 -0.2380 -0.2667 0.1082 0.0289 -0.2276 -0.2274 0.2658 -0.1176 -0.2543 0.3094 -0.2655 -0.2277 -0.0992 -0.0981 -0.2415 0.1136 0.0989 0.0953 0.0896 0.0932 0.0957 0.1051 0.0967 0.1302 0.0916 0.1044 0.0919 0.0955 0.1025 0.0923 0.1235 0.1163 0.1437 0.1454 0.1612 0.1492 0.1472 0.1543 0.1606 0.1764 0.1573
va: 2.1137 1.9898 2.0609 3.7253 3.7207 3.9498 3.9059 3.9053 3.8381 4.0483 3.7009 3.9185 3.9450 3.7934 3.6107 3.9285 3.9640 3.7164 3.8887 4.0144 3.6897 4.0162 3.9196 3.8631 3.7788 3.9740 1.0037 1.0292 1.0021 1.0045 1.0025 1.0137 0.9999 1.0016 1.0216 1.0068 0.9983 0.9939 0.9949 0.9978 1.0069 0.9925 1.0095 1.0169 1.0022 0.9877 1.0053 1.0078 1.0041 0.9875 0.9714 0.9945
dispcorr: -0.027666035 hartree
energy: -1117.880971047070
dipole: -19.20784 18.63196 -0.57589 -21.14924 20.73874 -0.41050 2.69157 -1.54990 1.14167
magnitude: 1.34297 au
magnitude: 3.41356 debye
