program: Orca
programVersion: 5.0.2
elementType: O O O C C C C C C C C C C C C C C C C C C C C C C C H H H H H H H H H H H H H H H H H H H H H H H H H H
charge: 0
multiplicity: 1
keywords: wb97x-d3
keywords: def2-TZVPP
keywords: def2/J RIJCOSX
keywords: DEFGRID2
keywords: scfconv7
keywords: smallprint printgap noloewdin
keywords: NOSOSCF
formula: C23H26O3
InChI: InChI=1/C23H26O3/c1-16(2)13-20-21(23(20,3)4)22(24)25-15-17-9-8-12-19(14-17)26-18-10-6-5-7-11-18/h5-14,20-21H,15H2,1-4H3
52 atoms
O  -2.309742 1.928247 -0.556849
O  -2.394853 0.072061 -1.809001
O  2.590674 -0.002403 -0.900387
C  -4.484514 -0.988978 0.197343
C  -3.180089 -1.261695 0.857474
C  -3.486959 0.147528 0.322014
C  -5.691927 -0.85018 1.095857
C  -4.829479 -1.606541 -1.13603
C  -2.11984 -2.101329 0.253094
C  -2.697003 0.670533 -0.800725
C  -0.833351 -2.026747 0.605952
C  0.207755 -2.893486 -0.028717
C  -0.341426 -1.039383 1.624724
C  -1.470216 2.604012 -1.503641
C  -0.023867 2.508624 -1.106611
C  0.648994 1.289601 -1.154158
C  0.654936 3.641536 -0.673458
C  1.977983 1.216785 -0.772881
C  1.99288 3.559557 -0.308736
C  2.666633 2.350354 -0.357162
C  3.396497 -0.498246 0.088694
C  4.347304 -1.429279 -0.310629
C  3.256825 -0.161944 1.429738
C  5.165945 -2.021709 0.638506
C  4.091294 -0.757087 2.366685
C  5.047221 -1.686119 1.980858
H  -3.205312 -1.282488 1.944296
H  -3.713804 0.884814 1.082626
H  -6.459187 -0.232296 0.625796
H  -5.437931 -0.395168 2.05385
H  -6.131182 -1.828733 1.298361
H  -5.357935 -2.546596 -0.967401
H  -3.972755 -1.825001 -1.76583
H  -5.498754 -0.95366 -1.698711
H  -2.413151 -2.818463 -0.507125
H  0.986418 -2.28295 -0.493021
H  -0.210745 -3.547365 -0.793616
H  0.709967 -3.516633 0.715523
H  -1.010393 -0.961276 2.483409
H  -0.260277 -0.036558 1.195356
H  0.646343 -1.309695 1.998045
H  -1.794302 3.643459 -1.487635
H  -1.633463 2.219296 -2.510356
H  0.15233 0.391387 -1.498863
H  0.140213 4.592997 -0.626787
H  2.518778 4.447513 0.01597
H  3.710914 2.294931 -0.07772
H  4.439968 -1.688783 -1.357687
H  2.509677 0.549935 1.754745
H  5.904539 -2.746655 0.322452
H  3.982603 -0.490662 3.409871
H  5.692545 -2.144337 2.718151
elementType: O C H
totalener: -1117.85126253 hartree
nucrepener: 2332.40615701 hartree
electener: -3450.25741954 hartree
oneelecener: -6154.91821852 hartree
twoeener: 2704.66079898 hartree
cpcmener: -0.02883233 hartree
kineticenergy: 1112.80386026 hartree
xcener: -110.230437393047 hartree
chargesum: -0.0000000
charge: -0.296430 -0.498837 -0.336701 0.125869 -0.027976 -0.095982 -0.265918 -0.294264 -0.254719 0.412428 -0.016307 -0.228009 -0.304107 0.084752 0.026473 -0.286841 -0.213484 0.285443 -0.122878 -0.213569 0.338568 -0.272288 -0.238651 -0.110047 -0.149963 -0.198071 0.114944 0.091656 0.096056 0.088091 0.095006 0.098668 0.089855 0.102872 0.127892 0.086289 0.094957 0.102857 0.115488 0.100108 0.105190 0.114339 0.117582 0.151677 0.145865 0.162963 0.156740 0.146255 0.162414 0.160340 0.162091 0.161315
qa: -0.2964 -0.4988 -0.3367 0.1259 -0.0280 -0.0960 -0.2659 -0.2943 -0.2547 0.4124 -0.0163 -0.2280 -0.3041 0.0848 0.0265 -0.2868 -0.2135 0.2854 -0.1229 -0.2136 0.3386 -0.2723 -0.2387 -0.1100 -0.1500 -0.1981 0.1149 0.0917 0.0961 0.0881 0.0950 0.0987 0.0899 0.1029 0.1279 0.0863 0.0950 0.1029 0.1155 0.1001 0.1052 0.1143 0.1176 0.1517 0.1459 0.1630 0.1567 0.1463 0.1624 0.1603 0.1621 0.1613
va: 2.1088 1.9827 2.0267 3.7751 3.8007 3.8543 3.8986 3.8912 3.7917 4.0700 3.6481 3.9159 3.9549 3.8081 3.6853 3.9644 3.9746 3.7401 3.8839 3.9435 3.5231 4.0076 3.8750 3.8672 3.9150 3.9077 1.0054 1.0336 1.0025 1.0047 1.0021 0.9990 1.0185 0.9997 0.9997 0.9994 1.0111 0.9947 1.0039 0.9966 1.0013 1.0002 1.0163 1.0260 1.0026 0.9882 0.9970 1.0092 0.9943 0.9878 0.9894 0.9893
dispcorr: -0.029128591 hartree
energy: -1117.880391116238
dipole: -14.90073 15.00877 0.10804 -11.13465 12.00516 0.87051 7.62361 -6.19147 1.43215
magnitude: 1.67944 au
magnitude: 4.26879 debye
