program: Orca
programVersion: 5.0.2
elementType: O O O C C C C C C C C C C C C C C C C C C C C C C C H H H H H H H H H H H H H H H H H H H H H H H H H H
charge: 0
multiplicity: 1
keywords: wb97x-d3
keywords: def2-TZVPP
keywords: def2/J RIJCOSX
keywords: DEFGRID2
keywords: scfconv7
keywords: smallprint printgap noloewdin
keywords: NOSOSCF
formula: C23H26O3
InChI: InChI=1/C23H26O3/c1-16(2)13-20-21(23(20,3)4)22(24)25-15-17-9-8-12-19(14-17)26-18-10-6-5-7-11-18/h5-14,20-21H,15H2,1-4H3
52 atoms
O  -1.525926 2.207064 0.215771
O  -0.525675 0.390979 1.051042
O  3.661807 0.85514 -1.481813
C  -2.740493 -1.165889 -0.479398
C  -3.339342 -0.936161 0.871912
C  -2.725775 0.238093 0.101228
C  -3.701939 -1.357381 -1.628602
C  -1.471303 -1.964198 -0.649836
C  -2.763326 -1.468988 2.119889
C  -1.482496 0.905134 0.516623
C  -3.448745 -1.822065 3.214556
C  -2.733091 -2.378246 4.40954
C  -4.93294 -1.714669 3.388785
C  -0.337644 2.991748 0.411156
C  0.624211 2.75868 -0.718094
C  1.732213 1.940575 -0.543917
C  0.37473 3.321716 -1.967904
C  2.557204 1.659302 -1.624698
C  1.221645 3.056479 -3.031781
C  2.311059 2.210303 -2.871349
C  3.521562 -0.359382 -0.857636
C  4.616357 -0.827203 -0.14351
C  2.364281 -1.123146 -0.961508
C  4.552629 -2.071835 0.466458
C  2.314888 -2.364114 -0.342165
C  3.403056 -2.8448 0.373655
H  -4.421446 -0.874538 0.866413
H  -3.452861 0.915181 -0.330808
H  -4.612792 -0.772116 -1.498793
H  -3.989487 -2.406902 -1.71508
H  -3.243697 -1.059517 -2.573706
H  -0.91712 -1.618514 -1.524766
H  -1.728489 -3.011132 -0.820999
H  -0.798625 -1.932459 0.201705
H  -1.689613 -1.607431 2.151776
H  -1.652914 -2.408744 4.267873
H  -3.073565 -3.393057 4.631582
H  -2.940421 -1.782614 5.302418
H  -5.461672 -1.3563 2.508277
H  -5.171846 -1.040623 4.215324
H  -5.355572 -2.686501 3.656133
H  0.115609 2.781508 1.380297
H  -0.688098 4.022397 0.418127
H  1.945185 1.516366 0.429453
H  -0.481864 3.969672 -2.107217
H  1.028615 3.498203 -4.000342
H  2.964791 1.985191 -3.704192
H  5.510757 -0.221702 -0.069052
H  1.508186 -0.768533 -1.521705
H  5.407941 -2.434069 1.021706
H  1.414721 -2.959228 -0.427249
H  3.355695 -3.813143 0.853252
elementType: O C H
totalener: -1117.85317223 hartree
nucrepener: 2292.31825875 hartree
electener: -3410.17143098 hartree
oneelecener: -6075.06011737 hartree
twoeener: 2664.88868639 hartree
cpcmener: -0.03036219 hartree
kineticenergy: 1112.79735677 hartree
xcener: -110.227387837439 hartree
chargesum: -0.0000000
charge: -0.295353 -0.500928 -0.345735 0.123943 0.021584 -0.092412 -0.263492 -0.306390 -0.290523 0.424713 -0.060018 -0.219167 -0.255986 0.088915 -0.015030 -0.158154 -0.225876 0.245859 -0.127072 -0.233155 0.293685 -0.254015 -0.203651 -0.124569 -0.153072 -0.198754 0.121654 0.096367 0.088461 0.095481 0.094749 0.107561 0.104277 0.082542 0.120914 0.088705 0.094108 0.092454 0.089584 0.097804 0.095860 0.115897 0.127582 0.144131 0.147094 0.162265 0.149920 0.147949 0.163584 0.161450 0.173257 0.161002
qa: -0.2954 -0.5009 -0.3457 0.1239 0.0216 -0.0924 -0.2635 -0.3064 -0.2905 0.4247 -0.0600 -0.2192 -0.2560 0.0889 -0.0150 -0.1582 -0.2259 0.2459 -0.1271 -0.2332 0.2937 -0.2540 -0.2037 -0.1246 -0.1531 -0.1988 0.1217 0.0964 0.0885 0.0955 0.0947 0.1076 0.1043 0.0825 0.1209 0.0887 0.0941 0.0925 0.0896 0.0978 0.0959 0.1159 0.1276 0.1441 0.1471 0.1623 0.1499 0.1479 0.1636 0.1615 0.1733 0.1610
va: 2.1197 1.9832 2.0596 3.7068 3.7385 3.8326 3.9061 3.9127 3.8447 4.0784 3.7927 3.9199 3.9379 3.8023 3.6216 3.8917 3.9701 3.7353 3.8814 4.0202 3.7011 4.0015 3.8809 3.8879 3.8735 3.9280 1.0005 1.0304 1.0058 1.0018 1.0019 0.9931 1.0028 1.0030 1.0182 1.0089 0.9962 0.9964 1.0138 0.9966 0.9968 1.0114 0.9940 1.0193 1.0031 0.9873 1.0039 1.0077 0.9912 0.9871 0.9831 0.9907
dispcorr: -0.025824485 hartree
energy: -1117.878996714511
dipole: -24.63988 23.14529 -1.49460 -16.17618 16.29803 0.12185 10.26852 -10.58408 -0.31556
magnitude: 1.53240 au
magnitude: 3.89505 debye
