program: Gaussian 09
title: 000067753
version: EM64L-G09RevD.01
frameworkgroup: C1[X(C4H8F3O3P)]
method: RPBEPBE
basis: SDD
operation: Freq
keyword: #p
keyword: freq=noraman
keyword: PBEPBE/SDD
title: #p freq=noraman PBEPBE/SDD
converged: YES YES NO NO
title: Mulliken charges:
elementType: P F F F O O O C C C C H H H H H H H H
charge: 1.458273 -0.369412 -0.243112 -0.242181 -0.535477 -0.494325 -0.566785 -0.260104 -0.311747 -0.184615 -0.167617 0.232600 0.276731 0.240944 0.281409 0.208795 0.228899 0.214569 0.233154
chargesum: 0.00000
title: Mulliken charges with hydrogens summed into heavy atoms:
elementType: P F F F O O O C C C C
charge: 1.458273 -0.369412 -0.243112 -0.242181 -0.535477 -0.494325 -0.566785 0.249227 0.210606 0.253078 0.280106
polarizability: 7.97162026e+01 -1.26420816e+00 7.90891048e+01 -9.06604841e-01 -6.33040424e+00 7.01748733e+01
1716.lowfreq: -14.7475 -12.1249 -0.0014 0.0002 0.0018 6.9437 43.7261 50.8642 61.7718
frequency: 43.5332 50.8558 61.7345 80.0990 98.5137 134.2565 145.6649 176.6476 222.0345 251.8386 277.7295 306.4996 340.5384 376.5454 382.0610 459.3830 493.1739 603.2014 688.2530 735.2806 828.3238 833.3205 869.8244 892.2984 987.2432 997.8751 1034.0095 1036.8672 1077.9146 1096.1508 1100.5914 1187.3156 1194.1230 1242.8379 1249.1395 1358.6266 1363.2959 1376.5602 1382.2703 1444.2697 1445.8222 1446.9129 1454.6440 3013.8262 3026.1744 3027.4692 3032.9976 3090.4916 3104.1759 3104.9640 3114.7392
redmass: 7.2774 7.0931 8.5320 7.9335 4.4467 4.4956 6.4032 8.0197 6.6934 3.0634 5.2006 3.3399 7.2876 5.8756 6.1859 3.4032 2.6050 6.4020 6.7836 15.1747 2.9064 3.3318 3.3945 3.5044 2.5819 2.7638 2.8124 2.6916 8.1424 2.1535 2.5401 1.1069 1.0916 1.1276 1.1300 1.2181 1.2244 1.2769 1.3547 1.0830 1.0902 1.0866 1.0785 1.0572 1.0591 1.0558 1.0612 1.1075 1.1072 1.1082 1.1095
irintensity: 4.6779 3.8827 2.7949 5.9887 9.2437 5.2960 2.4290 5.3131 4.2190 9.9521 27.9447 10.1149 27.6422 3.8338 21.2929 8.5166 16.1632 26.5386 114.2185 140.3625 13.6583 33.5364 124.4525 173.8608 0.9430 75.5288 116.8372 57.0241 130.4410 7.3890 14.9089 2.1409 3.8498 3.5433 2.9091 0.3623 2.6270 7.8845 6.9253 25.3143 7.9960 6.6142 9.1808 8.4927 60.0485 9.1771 30.6884 6.9424 7.6898 16.1865 10.3512
temp: 298.150 k
press: 1.00000 atm
elementType: 15 9 9 9 8 8 8 6 6 6 6 1 1 1 1 1 1 1 1
symmnumber: 1
zpe: 342986.8 jmol-1
zpe.correction: 0.130637 hartree
zpe.thermalcorrener: 0.143751 hartree
zpe.thermalcorrenthalpy: 0.144695 hartree
zpe.thermalcorrgfe: 0.089547 hartree
zpe.sumelectzpe: -1022.728334 hartree
zpe.sumelectthermal: -1022.715221 hartree
zpe.sumelectthermalent: -1022.714277 hartree
zpe.sumelectthermalfe: -1022.769424 hartree
dipole: 4.3385 1.2944 -1.0281
dipole: 4.6427
quadrupole: -77.5522 -56.1831 -76.0694
quadrupole: -9.6622 3.5051 -6.0128
quadrupole: -7.6173 13.7518 -6.1345 -9.6622 3.5051 -6.0128
hfenergy: -1022.8589713 hartree
pointgroup: C01 [X(C4H8F3O3P1)]
dipole: -0.2779089 1.8007924 0.1276241 debye
dipolederiv: 2.2252841 0.1554173 0.0679299 -0.0433332 2.2080563 -0.1721369 -0.0487076 0.1157707 1.6482298 -0.4182208 -0.0563339 0.0489947 -0.0404392 -0.6805892 0.2026739 0.0315341 0.2732426 -0.6624315 -0.5293648 -0.1979572 -0.0603859 -0.1119313 -0.5462174 -0.0921359 -0.0381284 -0.0804921 -0.2886993 -0.5460716 -0.0567785 -0.1767842 -0.0696558 -0.3008394 0.0196843 -0.1317636 0.0453893 -0.5057358 -1.1606453 0.4173057 -0.1736927 0.5082835 -0.8919594 0.1500848 -0.1847391 0.0786767 -0.5285101 -0.8314985 -0.3580206 0.0131217 -0.4509863 -1.0776897 -0.0192944 -0.0901657 -0.1739317 -0.54261 -0.650938 0.0028922 -0.0246056 0.0064261 -0.6848531 -0.0469083 0.0241061 -0.0815948 -0.5690131 0.5768905 -0.2070928 0.18021 -0.2886491 0.3723878 -0.156732 0.442112 -0.3953452 0.2500527 0.2205445 0.0904832 0.0278476 0.4026594 0.7560809 0.0315278 -0.0998023 -0.0661696 0.1374491 0.5176227 0.2335265 0.0283594 0.2172162 0.5319022 0.0585098 0.0183966 0.0889988 0.3731004 0.5604283 -0.0010158 0.1774929 -0.0136694 0.2771898 0.0162043 0.2166933 0.0531343 0.448895 -0.0921341 -0.0189607 -0.0771793 -0.0659601 -0.0089226 -0.0219262 -0.0925154 0.0275015 0.0648872 0.0659056 0.0358034 0.06477 0.0357758 0.0536036 0.0187482 -0.0105887 0.069949 0.0051932 0.005213 -0.0652738 -0.0995316 -0.0749221 0.0093698 -0.0058242 -0.0792695 -0.0076981 0.0343213 0.0595268 0.0500833 0.073729 -0.0353188 -0.0031297 0.0039103 0.0589128 0.0114959 0.0862267 -0.0375031 0.0206229 -0.0775765 0.0801205 -0.0192779 0.0521173 -0.1178317 0.0454308 0.0161165 0.0339721 -0.060596 0.0323688 -0.0699409 0.0628165 0.0239975 0.0983333 0.0060639 -0.0571826 0.0541762 -0.0264443 -0.0346906 -0.0955576 -0.1160582 -0.0107148 -0.0177193 0.0220292 0.0653233 -0.0531876 0.042339 0.0096224 0.1098822 0.0581297 -0.0517854 0.0211432 -0.0324511 0.024387 unknown
polarizability: 81.2827206|0.1253204|79.5689922|4.0054274|1.9428083|68.1284679 unknown
InChI: InChI=1S/C4H8F3O3P/c5-1-3-9-11(7,8)10-4-2-6/h1-4H2
charge 0 multiplicity 1
19 atoms
P  0.129207 -1.752516 0.530645
F  -0.105401 -2.892258 1.786422
F  -1.286241 2.244378 0.752464
F  1.055107 0.769466 -1.161655
O  -1.123649 -0.650879 0.938105
O  1.557424 -1.03363 1.16445
O  0.134509 -2.393831 -0.908612
C  -1.888226 0.052972 -0.128551
C  1.714283 0.44715 1.147888
C  -2.403076 1.328354 0.508296
C  2.167661 0.940477 -0.214904
H  -2.734536 -0.587132 -0.44027
H  -1.238496 0.265671 -0.994798
H  2.497043 0.632772 1.902369
H  0.770359 0.935149 1.450632
H  -3.1058 1.843122 -0.172391
H  -2.874622 1.127975 1.485787
H  2.404672 2.019263 -0.186317
H  3.011683 0.351798 -0.611864
