program: Orca
programVersion: 5.0.2
elementType: O O O C C C C C C C C C C C C C C C C C C C C C C C H H H H H H H H H H H H H H H H H H H H H H H H H H
charge: 0
multiplicity: 1
keywords: wb97x-d3
keywords: def2-TZVPP
keywords: def2/J RIJCOSX
keywords: DEFGRID2
keywords: scfconv7
keywords: smallprint printgap noloewdin
keywords: NOSOSCF
formula: C23H26O3
InChI: InChI=1/C23H26O3/c1-16(2)13-20-21(23(20,3)4)22(24)25-15-17-9-8-12-19(14-17)26-18-10-6-5-7-11-18/h5-14,20-21H,15H2,1-4H3
52 atoms
O  -1.904107 0.995479 -1.683454
O  -3.083479 -0.816667 -1.116781
O  2.946659 0.695506 0.275851
C  -4.960499 1.121835 0.424889
C  -3.838775 0.838947 1.360021
C  -3.538968 1.295566 -0.076564
C  -5.706132 2.421152 0.62464
C  -5.854413 0.016587 -0.081451
C  -3.50433 -0.530475 1.823986
C  -2.861846 0.366485 -0.991223
C  -2.283398 -0.923543 2.19553
C  -2.01096 -2.326495 2.641024
C  -1.085904 -0.02629 2.149431
C  -1.015765 0.196314 -2.480632
C  0.042779 -0.424126 -1.61456
C  1.053246 0.384194 -1.099088
C  0.013781 -1.773701 -1.28504
C  2.007178 -0.155671 -0.254893
C  0.977778 -2.304652 -0.436565
C  1.975749 -1.5011 0.090503
C  4.279524 0.420728 0.120319
C  5.1406 1.007454 1.040022
C  4.778541 -0.359004 -0.915945
C  6.507475 0.809575 0.920677
C  6.149777 -0.554566 -1.015653
C  7.020554 0.023278 -0.1030
H  -3.625522 1.626026 2.078674
H  -3.20379 2.321937 -0.167475
H  -6.157831 2.760382 -0.309359
H  -5.051849 3.214718 0.98747
H  -6.508504 2.292614 1.353619
H  -5.373134 -0.954063 -0.153634
H  -6.249004 0.266458 -1.067757
H  -6.706954 -0.091454 0.591727
H  -4.31452 -1.25265 1.862381
H  -2.90292 -2.951594 2.607855
H  -1.617127 -2.347554 3.660202
H  -1.249285 -2.78929 2.006834
H  -1.339247 1.025048 2.023213
H  -0.428176 -0.30998 1.322652
H  -0.491682 -0.12338 3.060886
H  -0.575541 0.896611 -3.18868
H  -1.564129 -0.556358 -3.047343
H  1.097351 1.43673 -1.354253
H  -0.759363 -2.414188 -1.688937
H  0.947104 -3.354128 -0.175447
H  2.717101 -1.916161 0.761756
H  4.740034 1.616559 1.840572
H  4.119274 -0.809782 -1.646265
H  7.173327 1.269509 1.639158
H  6.535206 -1.163268 -1.823137
H  8.087033 -0.134616 -0.189782
elementType: O C H
totalener: -1117.85262912 hartree
nucrepener: 2277.02350598 hartree
electener: -3394.87613510 hartree
oneelecener: -6044.28447751 hartree
twoeener: 2649.40834242 hartree
cpcmener: -0.02999314 hartree
kineticenergy: 1112.80259897 hartree
xcener: -110.229030386018 hartree
chargesum: -0.0000000
charge: -0.296639 -0.494429 -0.343438 0.133135 -0.010353 -0.114423 -0.264831 -0.299349 -0.284012 0.408477 -0.016671 -0.223167 -0.204195 0.082551 0.000427 -0.245223 -0.161934 0.262381 -0.162717 -0.171490 0.309585 -0.266480 -0.198491 -0.122410 -0.160250 -0.195747 0.111647 0.093644 0.095773 0.087887 0.094953 0.092005 0.102419 0.099406 0.125319 0.090988 0.097515 0.090693 0.101417 0.014245 0.110349 0.125911 0.116097 0.133470 0.143981 0.162443 0.161712 0.147291 0.155655 0.161193 0.162809 0.160871
qa: -0.2966 -0.4944 -0.3434 0.1331 -0.0104 -0.1144 -0.2648 -0.2993 -0.2840 0.4085 -0.0167 -0.2232 -0.2042 0.0826 0.0004 -0.2452 -0.1619 0.2624 -0.1627 -0.1715 0.3096 -0.2665 -0.1985 -0.1224 -0.1602 -0.1957 0.1116 0.0936 0.0958 0.0879 0.0950 0.0920 0.1024 0.0994 0.1253 0.0910 0.0975 0.0907 0.1014 0.0142 0.1103 0.1259 0.1161 0.1335 0.1440 0.1624 0.1617 0.1473 0.1557 0.1612 0.1628 0.1609
va: 2.1070 1.9913 2.0457 3.7454 3.8091 3.8431 3.8993 3.8912 3.8484 4.0980 3.6919 3.9287 3.9342 3.8044 3.6064 4.0426 3.8587 3.6812 3.8776 3.8955 3.6695 3.9995 3.8776 3.8857 3.8997 3.9006 1.0067 1.0317 1.0022 1.0044 1.0020 1.0165 1.0001 0.9983 0.9997 1.0072 0.9975 0.9953 1.0082 1.0325 1.0041 0.9955 1.0110 1.0193 1.0132 0.9908 0.9930 1.0093 1.0005 0.9879 0.9895 0.9896
dispcorr: -0.027540170 hartree
energy: -1117.880169285022
dipole: -20.20837 20.76878 0.56041 -1.42554 1.76877 0.34323 9.76951 -9.76497 0.00454
magnitude: 0.65718 au
magnitude: 1.67042 debye
