program: Orca
programVersion: 5.0.2
elementType: O O O C C C C C C C C C C C C C C C C C C C C C C C H H H H H H H H H H H H H H H H H H H H H H H H H H
charge: 0
multiplicity: 1
keywords: wb97x-d3
keywords: def2-TZVPP
keywords: def2/J RIJCOSX
keywords: DEFGRID2
keywords: scfconv7
keywords: smallprint printgap noloewdin
keywords: NOSOSCF
formula: C23H26O3
InChI: InChI=1/C23H26O3/c1-16(2)13-20-21(23(20,3)4)22(24)25-15-17-9-8-12-19(14-17)26-18-10-6-5-7-11-18/h5-14,20-21H,15H2,1-4H3
52 atoms
O  -2.072791 1.344835 -0.532896
O  -1.624636 1.826286 1.593906
O  2.942622 0.772025 -0.620123
C  -3.425112 -1.207584 0.408853
C  -1.985213 -1.606435 0.318919
C  -2.386831 -0.345868 1.100777
C  -4.292489 -2.006807 1.353654
C  -4.18575 -0.744671 -0.810242
C  -1.208123 -1.565962 -0.932372
C  -1.994544 1.03108 0.755895
C  -0.30058 -2.468986 -1.323997
C  0.424432 -2.296893 -2.62474
C  0.067138 -3.711301 -0.571724
C  -1.599015 2.627435 -0.940861
C  -0.113131 2.781947 -0.766049
C  0.731077 1.680501 -0.809049
C  0.426837 4.050636 -0.577942
C  2.091634 1.850502 -0.603026
C  1.795331 4.21067 -0.424589
C  2.639213 3.108639 -0.416828
C  2.728865 -0.28369 0.227426
C  1.915044 -0.220043 1.353223
C  3.425053 -1.449896 -0.071529
C  1.807363 -1.335684 2.174321
C  3.315475 -2.548736 0.765607
C  2.505808 -2.500304 1.893102
H  -1.70457 -2.406156 0.995054
H  -2.345578 -0.480488 2.175235
H  -5.145802 -1.41622 1.692745
H  -3.741144 -2.333626 2.235974
H  -4.680846 -2.896404 0.85444
H  -4.940131 -0.005086 -0.536708
H  -4.71094 -1.59849 -1.242517
H  -3.568984 -0.318837 -1.595741
H  -1.398785 -0.743316 -1.610152
H  1.498604 -2.17955 -2.456014
H  0.074538 -1.42731 -3.180802
H  0.306881 -3.176903 -3.262435
H  1.149364 -3.848196 -0.557143
H  -0.346226 -4.589698 -1.074322
H  -0.283294 -3.7271 0.457842
H  -2.131339 3.421704 -0.413992
H  -1.870364 2.694235 -1.994359
H  0.341225 0.683214 -0.976474
H  -0.225235 4.914497 -0.541597
H  2.209194 5.199529 -0.279536
H  3.704384 3.224647 -0.264595
H  1.366758 0.677528 1.606724
H  4.055608 -1.490055 -0.9507
H  1.172237 -1.281218 3.048838
H  3.863253 -3.45114 0.527707
H  2.417635 -3.361756 2.541124
elementType: O C H
totalener: -1117.85108574 hartree
nucrepener: 2414.69911425 hartree
electener: -3532.55019998 hartree
oneelecener: -6319.35036225 hartree
twoeener: 2786.80016226 hartree
cpcmener: -0.03184382 hartree
kineticenergy: 1112.81241727 hartree
xcener: -110.237603019644 hartree
chargesum: 0.0000000
charge: -0.280581 -0.496967 -0.337768 0.119911 0.033651 -0.109356 -0.271753 -0.274026 -0.293112 0.411618 -0.060932 -0.223891 -0.304025 0.068045 0.006027 -0.179566 -0.206869 0.238536 -0.130865 -0.221059 0.354468 -0.215175 -0.289047 -0.161467 -0.116824 -0.196380 0.121248 0.097323 0.095399 0.088591 0.095170 0.104274 0.095817 0.092473 0.132061 0.092904 0.091366 0.105517 0.097939 0.119523 0.094552 0.123495 0.120224 0.136632 0.144888 0.161299 0.148099 0.150896 0.145794 0.161620 0.162003 0.158300
qa: -0.2806 -0.4970 -0.3378 0.1199 0.0337 -0.1094 -0.2718 -0.2740 -0.2931 0.4116 -0.0609 -0.2239 -0.3040 0.0680 0.0060 -0.1796 -0.2069 0.2385 -0.1309 -0.2211 0.3545 -0.2152 -0.2890 -0.1615 -0.1168 -0.1964 0.1212 0.0973 0.0954 0.0886 0.0952 0.1043 0.0958 0.0925 0.1321 0.0929 0.0914 0.1055 0.0979 0.1195 0.0946 0.1235 0.1202 0.1366 0.1449 0.1613 0.1481 0.1509 0.1458 0.1616 0.1620 0.1583
va: 2.1117 1.9903 2.0704 3.7491 3.6986 3.8380 3.9099 3.9001 3.7982 4.1022 3.6897 3.9058 3.9397 3.7954 3.6236 3.8738 3.9494 3.7371 3.8871 3.9982 3.5951 3.8375 3.9287 3.8501 3.8055 3.8529 0.9964 1.0267 1.0015 1.0058 1.0016 1.0007 1.0007 1.0084 1.0049 0.9970 1.0078 0.9973 0.9949 0.9973 1.0091 1.0067 0.9955 1.0162 0.9998 0.9876 1.0045 1.0092 1.0100 0.9899 0.9869 0.9907
dispcorr: -0.031432647 hartree
energy: -1117.882518382509
dipole: -14.12515 13.27124 -0.85390 -19.15381 18.27243 -0.88138 -4.21593 3.39578 -0.82016
magnitude: 1.47602 au
magnitude: 3.75174 debye
