program: Orca
programVersion: 5.0.2
elementType: O O O C C C C C C C C C C C C C C C C C C C C C C C H H H H H H H H H H H H H H H H H H H H H H H H H H
charge: 0
multiplicity: 1
keywords: wb97x-d3
keywords: def2-TZVPP
keywords: def2/J RIJCOSX
keywords: DEFGRID2
keywords: scfconv7
keywords: smallprint printgap noloewdin
keywords: NOSOSCF
formula: C23H26O3
InChI: InChI=1/C23H26O3/c1-16(2)13-20-21(23(20,3)4)22(24)25-15-17-9-8-12-19(14-17)26-18-10-6-5-7-11-18/h5-14,20-21H,15H2,1-4H3
52 atoms
O  -2.02446 1.387879 -1.706618
O  -1.04328 -0.599556 -1.423327
O  3.276092 0.90923 0.234217
C  -3.707273 -1.584047 -0.199495
C  -3.114215 -0.761629 0.891967
C  -3.232139 -0.187774 -0.530189
C  -5.211293 -1.735857 -0.190152
C  -3.007365 -2.816805 -0.717598
C  -1.802539 -1.062473 1.517914
C  -1.995019 0.129232 -1.257404
C  -1.105774 -0.191197 2.254713
C  0.162816 -0.580413 2.948804
C  -1.524082 1.230989 2.461915
C  -0.829261 1.929083 -2.290857
C  0.178237 2.245974 -1.222665
C  1.291574 1.433644 -1.047898
C  -0.030704 3.326291 -0.370631
C  2.159273 1.669246 0.009676
C  0.864595 3.577158 0.658092
C  1.952542 2.741986 0.866317
C  3.296291 -0.439208 -0.017407
C  4.532991 -0.97898 -0.347393
C  2.179531 -1.257818 0.104241
C  4.651397 -2.345441 -0.553921
C  2.311721 -2.621693 -0.117254
C  3.542112 -3.173521 -0.446175
H  -3.83258 -0.301501 1.564006
H  -4.010707 0.556297 -0.651316
H  -5.707464 -0.846539 0.200416
H  -5.506346 -2.581552 0.433755
H  -5.592899 -1.91564 -1.196868
H  -3.340495 -3.684129 -0.1447
H  -1.924303 -2.780944 -0.652967
H  -3.271343 -2.9955 -1.761197
H  -1.415262 -2.070915 1.407506
H  0.069748 -0.438717 4.028909
H  0.996102 0.050525 2.628343
H  0.433976 -1.620193 2.767254
H  -2.393914 1.518825 1.874176
H  -0.706635 1.906898 2.200802
H  -1.750914 1.419144 3.51478
H  -1.160512 2.834703 -2.795903
H  -0.421725 1.252593 -3.043127
H  1.464445 0.613622 -1.732436
H  -0.890012 3.970159 -0.511658
H  0.707646 4.419785 1.318383
H  2.640886 2.923482 1.681976
H  5.396717 -0.331787 -0.4329
H  1.211717 -0.853526 0.367799
H  5.618042 -2.761311 -0.806028
H  1.438083 -3.254137 -0.026027
H  3.635952 -4.237837 -0.614843
elementType: O C H
totalener: -1117.85159788 hartree
nucrepener: 2395.39227764 hartree
electener: -3513.24387553 hartree
oneelecener: -6281.30671981 hartree
twoeener: 2768.06284428 hartree
cpcmener: -0.02830928 hartree
kineticenergy: 1112.81305942 hartree
xcener: -110.233899048345 hartree
chargesum: -0.0000000
charge: -0.291852 -0.495402 -0.338478 0.144331 -0.009592 -0.117501 -0.265140 -0.299503 -0.281885 0.410967 -0.009015 -0.239891 -0.275597 0.083382 0.011501 -0.200024 -0.263001 0.305928 -0.093908 -0.265996 0.334063 -0.251535 -0.190978 -0.133860 -0.173314 -0.176260 0.111985 0.094072 0.087951 0.094652 0.096517 0.099383 0.088196 0.102901 0.129729 0.111225 0.089723 0.093872 0.094929 0.083205 0.115959 0.128189 0.116284 0.145999 0.143366 0.162114 0.147216 0.146597 0.116439 0.161030 0.160247 0.160780
qa: -0.2919 -0.4954 -0.3385 0.1443 -0.0096 -0.1175 -0.2651 -0.2995 -0.2819 0.4110 -0.0090 -0.2399 -0.2756 0.0834 0.0115 -0.2000 -0.2630 0.3059 -0.0939 -0.2660 0.3341 -0.2515 -0.1910 -0.1339 -0.1733 -0.1763 0.1120 0.0941 0.0880 0.0947 0.0965 0.0994 0.0882 0.1029 0.1297 0.1112 0.0897 0.0939 0.0949 0.0832 0.1160 0.1282 0.1163 0.1460 0.1434 0.1621 0.1472 0.1466 0.1164 0.1610 0.1602 0.1608
va: 2.1097 1.9887 2.0747 3.7581 3.7788 3.8465 3.8952 3.8998 3.8294 4.1014 3.6625 3.9184 3.9335 3.8132 3.5700 3.8915 3.9387 3.6680 3.8090 3.9722 3.6494 3.9867 3.8789 3.8885 3.9239 3.9003 1.0033 1.0314 1.0041 1.0023 1.0024 0.9992 1.0136 0.9998 0.9997 1.0001 0.9912 1.0057 1.0069 1.0069 1.0020 0.9935 1.0090 1.0139 1.0062 0.9869 1.0076 1.0089 0.9958 0.9879 0.9925 0.9895
dispcorr: -0.030987897 hartree
energy: -1117.882585782137
dipole: -17.43136 16.29313 -1.13823 -8.64325 9.22058 0.57733 9.52122 -9.19619 0.32503
magnitude: 1.31701 au
magnitude: 3.34757 debye
