program: Orca
programVersion: 5.0.2
elementType: O O O C C C C C C C C C C C C C C C C C C C C C C C H H H H H H H H H H H H H H H H H H H H H H H H H H
charge: 0
multiplicity: 1
keywords: wb97x-d3
keywords: def2-TZVPP
keywords: def2/J RIJCOSX
keywords: DEFGRID2
keywords: scfconv7
keywords: smallprint printgap noloewdin
keywords: NOSOSCF
formula: C23H26O3
InChI: InChI=1/C23H26O3/c1-16(2)13-20-21(23(20,3)4)22(24)25-15-17-9-8-12-19(14-17)26-18-10-6-5-7-11-18/h5-14,20-21H,15H2,1-4H3
52 atoms
O  -1.346439 -1.865758 0.272924
O  -2.598102 -0.798074 1.787913
O  2.96605 0.999364 -0.861447
C  -4.789382 -0.645216 -0.40388
C  -3.88912 0.507652 -0.671493
C  -3.297834 -0.902234 -0.50314
C  -5.585144 -1.175098 -1.574453
C  -5.53088 -0.771602 0.903783
C  -3.627362 1.577118 0.321274
C  -2.425776 -1.168133 0.648426
C  -2.514966 2.316178 0.343663
C  -2.292498 3.369637 1.383311
C  -1.385529 2.104922 -0.618735
C  -0.276716 -2.020178 1.219125
C  0.559554 -0.772959 1.263927
C  1.409777 -0.490967 0.199548
C  0.457381 0.131494 2.317185
C  2.148532 0.683193 0.198457
C  1.191704 1.308887 2.297418
C  2.04344 1.592277 1.239157
C  3.95315 0.115142 -1.216699
C  4.622761 -0.664758 -0.281435
C  4.29756 0.06131 -2.560844
C  5.640491 -1.507406 -0.706719
C  5.322399 -0.780218 -2.968906
C  5.995638 -1.571222 -2.047259
H  -3.847877 0.830847 -1.70872
H  -2.968677 -1.372439 -1.422131
H  -5.8326 -2.228937 -1.434156
H  -5.038814 -1.081858 -2.513843
H  -6.521775 -0.624258 -1.678933
H  -5.030057 -0.309025 1.748874
H  -5.697885 -1.821962 1.148662
H  -6.51091 -0.300507 0.807154
H  -4.389971 1.76232 1.071766
H  -2.146254 4.3519 0.927223
H  -1.384254 3.157586 1.95526
H  -3.124086 3.439551 2.084264
H  -0.646774 1.415007 -0.198603
H  -0.860646 3.040459 -0.822067
H  -1.710815 1.687448 -1.571944
H  0.302837 -2.862619 0.845211
H  -0.658097 -2.284142 2.205616
H  1.494918 -1.18792 -0.626943
H  -0.194957 -0.082337 3.153665
H  1.108365 2.010413 3.116913
H  2.622065 2.506932 1.222605
H  4.364729 -0.61871 0.768999
H  3.767974 0.674009 -3.27955
H  6.161551 -2.113794 0.022727
H  5.588679 -0.821556 -4.016996
H  6.790929 -2.229486 -2.370153
elementType: O C H
totalener: -1117.85207756 hartree
nucrepener: 2295.28657637 hartree
electener: -3413.13865393 hartree
oneelecener: -6080.77772698 hartree
twoeener: 2667.63907305 hartree
cpcmener: -0.02998322 hartree
kineticenergy: 1112.79697634 hartree
xcener: -110.227461987687 hartree
chargesum: -0.0000000
charge: -0.297176 -0.492788 -0.349319 0.131708 -0.014796 -0.096798 -0.264780 -0.296240 -0.270087 0.393334 -0.017721 -0.221233 -0.237010 0.077739 -0.012918 -0.152841 -0.156921 0.224963 -0.168369 -0.209829 0.267703 -0.171637 -0.244005 -0.163105 -0.129865 -0.187404 0.112050 0.091921 0.095944 0.087384 0.094566 0.090961 0.102443 0.098445 0.124763 0.097604 0.091570 0.090122 0.032575 0.110189 0.106701 0.126021 0.116672 0.145595 0.143442 0.162110 0.149608 0.156151 0.147701 0.162555 0.160846 0.161455
qa: -0.2972 -0.4928 -0.3493 0.1317 -0.0148 -0.0968 -0.2648 -0.2962 -0.2701 0.3933 -0.0177 -0.2212 -0.2370 0.0777 -0.0129 -0.1528 -0.1569 0.2250 -0.1684 -0.2098 0.2677 -0.1716 -0.2440 -0.1631 -0.1299 -0.1874 0.1120 0.0919 0.0959 0.0874 0.0946 0.0910 0.1024 0.0984 0.1248 0.0976 0.0916 0.0901 0.0326 0.1102 0.1067 0.1260 0.1167 0.1456 0.1434 0.1621 0.1496 0.1562 0.1477 0.1626 0.1608 0.1615
va: 2.1038 1.9913 2.0358 3.7547 3.8056 3.8420 3.8980 3.8901 3.8282 4.1023 3.6812 3.9248 3.9520 3.8163 3.6024 3.8889 3.8426 3.7094 3.8820 3.9629 3.6941 3.8642 3.9953 3.8998 3.8912 3.8912 1.0068 1.0323 1.0022 1.0047 1.0023 1.0171 0.9997 0.9988 1.0000 0.9976 0.9957 1.0076 1.0229 1.0022 1.0071 0.9954 1.0103 1.0076 1.0134 0.9893 1.0034 0.9991 1.0081 0.9896 0.9880 0.9891
dispcorr: -0.027943642 hartree
energy: -1117.880021205158
dipole: -21.76454 22.20404 0.43949 5.03001 -5.53278 -0.50277 -0.79040 0.17369 -0.61672
magnitude: 0.90900 au
magnitude: 2.31048 debye
