program: Orca
programVersion: 5.0.2
elementType: O O O C C C C C C C C C C C C C C C C C C C C C C C H H H H H H H H H H H H H H H H H H H H H H H H H H
charge: 0
multiplicity: 1
keywords: wb97x-d3
keywords: def2-TZVPP
keywords: def2/J RIJCOSX
keywords: DEFGRID2
keywords: scfconv7
keywords: smallprint printgap noloewdin
keywords: NOSOSCF
formula: C23H26O3
InChI: InChI=1/C23H26O3/c1-16(2)13-20-21(23(20,3)4)22(24)25-15-17-9-8-12-19(14-17)26-18-10-6-5-7-11-18/h5-14,20-21H,15H2,1-4H3
52 atoms
O  -1.994481 1.508007 -1.227812
O  -1.656003 -0.672823 -1.620497
O  2.83202 1.194011 0.953957
C  -4.287642 -1.130944 -0.031125
C  -3.208258 -1.088314 0.991316
C  -3.319402 0.037408 -0.04543
C  -5.682949 -0.773612 0.425557
C  -4.285799 -2.173952 -1.120597
C  -2.064724 -2.032843 0.989462
C  -2.253891 0.206902 -1.043496
C  -0.873803 -1.773487 1.535245
C  0.235306 -2.778215 1.500943
C  -0.547812 -0.472236 2.203737
C  -0.956666 1.904035 -2.132254
C  0.24906 2.386479 -1.376381
C  0.982579 1.510528 -0.578082
C  0.636222 3.717642 -1.474377
C  2.100982 1.975675 0.098527
C  1.754009 4.17191 -0.788444
C  2.494299 3.30431 -0.004127
C  3.181871 -0.095786 0.660933
C  3.296547 -0.5905 -0.632324
C  3.489562 -0.898344 1.753808
C  3.706528 -1.904707 -0.818244
C  3.911459 -2.202554 1.550262
C  4.015204 -2.716338 0.264069
H  -3.515341 -0.751654 1.977866
H  -3.717306 0.971481 0.332529
H  -5.673112 -0.013915 1.20797
H  -6.191686 -1.653863 0.822825
H  -6.280445 -0.391412 -0.404108
H  -4.839628 -3.050648 -0.779717
H  -3.296916 -2.509838 -1.41751
H  -4.790561 -1.795894 -2.011195
H  -2.22204 -3.002643 0.527139
H  1.061201 -2.412875 0.884662
H  -0.08909 -3.736157 1.094873
H  0.647538 -2.951939 2.498046
H  0.465806 -0.148637 1.960151
H  -0.580927 -0.578696 3.291895
H  -1.230779 0.331724 1.931786
H  -1.371377 2.71352 -2.731735
H  -0.696189 1.088818 -2.806788
H  0.685523 0.471883 -0.493686
H  0.062567 4.400902 -2.087825
H  2.052514 5.208811 -0.865853
H  3.367495 3.650535 0.533859
H  3.079136 0.029771 -1.491817
H  3.399995 -0.497517 2.755679
H  3.792333 -2.289364 -1.826104
H  4.151178 -2.821584 2.404832
H  4.33628 -3.737231 0.106848
elementType: O C H
totalener: -1117.85214980 hartree
nucrepener: 2348.06702943 hartree
electener: -3465.91917923 hartree
oneelecener: -6186.27532272 hartree
twoeener: 2720.35614349 hartree
cpcmener: -0.02927861 hartree
kineticenergy: 1112.79939460 hartree
xcener: -110.231155922899 hartree
chargesum: -0.0000000
charge: -0.298148 -0.496894 -0.339620 0.132393 -0.018243 -0.113377 -0.265728 -0.300303 -0.271593 0.419482 0.005579 -0.218134 -0.280641 0.077909 -0.013315 -0.228965 -0.217796 0.331193 -0.108099 -0.260845 0.330632 -0.223838 -0.273294 -0.133946 -0.119448 -0.199432 0.115845 0.094934 0.088394 0.094764 0.096143 0.100236 0.091866 0.102381 0.126096 0.056414 0.097026 0.102994 0.069177 0.122543 0.101733 0.113196 0.117646 0.152365 0.145201 0.161411 0.147742 0.159890 0.145709 0.161856 0.159193 0.159716
qa: -0.2981 -0.4969 -0.3396 0.1324 -0.0182 -0.1134 -0.2657 -0.3003 -0.2716 0.4195 0.0056 -0.2181 -0.2806 0.0779 -0.0133 -0.2290 -0.2178 0.3312 -0.1081 -0.2608 0.3306 -0.2238 -0.2733 -0.1339 -0.1194 -0.1994 0.1158 0.0949 0.0884 0.0948 0.0961 0.1002 0.0919 0.1024 0.1261 0.0564 0.0970 0.1030 0.0692 0.1225 0.1017 0.1132 0.1176 0.1524 0.1452 0.1614 0.1477 0.1599 0.1457 0.1619 0.1592 0.1597
va: 2.1120 1.9838 2.0552 3.7526 3.8117 3.8498 3.8977 3.8957 3.8389 4.0752 3.6416 3.9372 3.9478 3.8139 3.7574 3.9292 3.9575 3.6210 3.8849 4.0378 3.6086 3.8923 3.9325 3.8721 3.8397 3.8911 1.0027 1.0319 1.0044 1.0020 1.0024 0.9984 1.0167 0.9999 1.0008 1.0039 1.0142 0.9927 1.0035 0.9995 1.0055 1.0014 1.0189 0.9955 1.0033 0.9876 1.0068 0.9961 1.0110 0.9891 0.9896 0.9904
dispcorr: -0.029336342 hartree
energy: -1117.881486144229
dipole: -16.34961 15.88762 -0.46199 -12.74308 13.37629 0.63321 5.16906 -5.02112 0.14793
magnitude: 0.79767 au
magnitude: 2.02750 debye
