program: Gaussian 09
title: 000067751
version: EM64L-G09RevD.01
frameworkgroup: C1[X(C6H13F3O2Si)]
method: RPBEPBE
basis: SDD
operation: Freq
keyword: #p
keyword: freq=noraman
keyword: PBEPBE/SDD
title: #p freq=noraman PBEPBE/SDD
converged: YES YES NO NO
title: Mulliken charges:
elementType: Si F F F O O C C C C C C H H H H H H H H H H H H H
charge: 1.491894 -0.168910 -0.170903 -0.169683 -0.586055 -0.590008 -0.885079 -0.433744 -1.063950 0.400085 -0.485915 -0.488167 0.277350 0.277828 0.259472 0.250309 0.256224 0.260873 0.244913 0.235675 0.215655 0.210426 0.206874 0.233237 0.221599
chargesum: 0.00000
title: Mulliken charges with hydrogens summed into heavy atoms:
elementType: Si F F F O O C C C C C C
charge: 1.491894 -0.168910 -0.170903 -0.169683 -0.586055 -0.590008 -0.329901 0.076037 -0.301941 0.400085 0.175841 0.173543
polarizability: 1.04480532e+02 2.30360660e+00 9.14036032e+01 3.69579681e+00 -2.00190115e+00 8.59306757e+01
1716.lowfreq: -8.3405 -0.0013 -0.0009 0.0009 5.6731 6.5808 26.0973 29.2786 59.6166
frequency: 25.8789 28.8968 59.6061 64.6654 76.3389 82.9666 88.0275 100.4649 107.8623 133.4232 136.5047 161.5389 204.7658 228.5359 229.9731 324.8026 346.0567 357.1594 370.9963 469.6277 488.5902 544.8606 590.7069 668.4688 701.3496 730.3526 759.2274 795.4463 855.7127 866.6717 904.4166 1013.3906 1020.2664 1037.7977 1043.0388 1054.4335 1119.3841 1121.1188 1146.2263 1146.8089 1194.0536 1214.1055 1235.0149 1302.8509 1316.5397 1356.1049 1436.7323 1440.2882 1443.5830 1447.9604 1452.7793 1458.9957 1470.7509 1473.0593 1474.9945 1476.9698 2945.0700 2948.5010 2995.3243 3008.7333 3019.5204 3030.6531 3033.1905 3063.4588 3084.4476 3088.0294 3088.6434 3097.7294 3102.2071
redmass: 6.8644 4.2470 2.7569 4.5012 1.1128 2.9269 1.0924 3.1256 1.0570 3.0845 3.2535 4.7101 2.7801 4.3500 4.9876 4.1118 4.8720 6.0413 5.9115 6.7681 9.2883 7.2790 6.6807 3.8328 3.1514 2.0125 3.6734 2.9319 1.8735 1.5519 2.1399 1.7780 8.1087 4.7545 6.1628 5.5382 1.2585 1.2556 1.4060 1.3976 1.5007 5.3958 1.3335 1.1653 1.2028 1.5141 1.0651 1.0979 1.0892 1.0985 1.0629 1.0992 1.0524 1.0533 1.0524 1.0513 1.0335 1.0323 1.0350 1.0599 1.0591 1.1015 1.1032 1.1005 1.1018 1.1005 1.1001 1.0974 1.0988
irintensity: 0.1141 0.7474 1.1116 0.3022 1.6416 9.5270 0.8343 3.5590 0.2046 4.9547 8.5267 5.4571 1.4894 10.2805 3.7780 4.6372 14.8770 12.2969 38.9177 0.9383 8.1536 18.2394 3.9336 34.9958 14.4331 10.1429 10.9291 61.8293 89.7699 78.2780 197.9509 31.2479 221.9798 137.0734 186.7511 125.6281 0.2396 0.0305 31.8142 25.9004 77.6951 183.7642 82.9682 11.2008 56.6313 26.4836 4.8427 0.8582 0.8468 2.4800 29.6720 18.3701 10.9764 3.8163 9.2923 5.9082 79.6529 75.1080 4.7971 0.6754 14.2809 44.6905 70.4344 0.1107 13.2707 44.2066 23.7730 10.1722 9.6841
temp: 298.150 k
press: 1.00000 atm
elementType: 14 9 9 9 8 8 6 6 6 6 6 6 1 1 1 1 1 1 1 1 1 1 1 1 1
symmnumber: 1
zpe: 495891.9 jmol-1
zpe.correction: 0.188875 hartree
zpe.thermalcorrener: 0.205763 hartree
zpe.thermalcorrenthalpy: 0.206707 hartree
zpe.thermalcorrgfe: 0.141614 hartree
zpe.sumelectzpe: -974.870997 hartree
zpe.sumelectthermal: -974.854109 hartree
zpe.sumelectthermalent: -974.853165 hartree
zpe.sumelectthermalfe: -974.918258 hartree
dipole: -3.7445 -0.0123 0.9817
dipole: 3.8711
quadrupole: -84.4197 -74.8049 -81.9003
quadrupole: 1.7057 3.6576 -3.9061
quadrupole: -4.0448 5.5701 -1.5253 1.7057 3.6576 -3.9061
hfenergy: -975.0598723 hartree
pointgroup: C01 [X(C6H13F3O2Si1)]
dipole: -1.4566191 0.0805149 -0.4373957 debye
dipolederiv: 1.9878126 -0.0216677 -0.0559962 -0.1020217 1.856831 -0.1152426 -0.2493407 0.1831567 1.4850903 -0.8434069 0.1110081 0.2803672 0.1144696 -0.32002 -0.0820495 0.2322972 -0.072515 -0.5252912 -0.4386229 0.0603462 -0.0819036 0.0095248 -0.5452824 0.2490568 -0.0421652 0.2744062 -0.5671455 -0.4794003 -0.1578881 -0.1009144 -0.0984397 -0.6855253 -0.1763446 -0.0975023 -0.2090293 -0.3952286 -1.4992427 0.1847466 0.3135264 0.1619353 -0.7009695 -0.018238 0.3804524 -0.0954844 -0.737069 -0.7451752 -0.0682884 -0.0040436 -0.0498866 -1.5225456 0.1019922 0.0109327 0.063692 -0.6088353 -0.4631486 -0.0108952 -0.0561348 0.0276814 -0.2413988 0.028451 -0.0807767 -0.0105073 -0.2827351 -0.2303104 0.0266887 -0.0306449 -0.00962 0.0076224 -0.0097567 -0.2260128 0.0010853 -0.043087 -0.409034 0.0476677 -0.0493186 0.0242868 -0.365639 0.1103739 -0.0153197 0.1321326 -0.4498761 1.713913 -0.0084454 -0.0245413 -0.0121802 1.4674481 0.0022805 0.0210623 -0.0035325 1.4127785 0.903365 -0.1298306 -0.2544133 -0.0779231 0.3355815 0.015412 0.0071363 -0.016627 0.234735 0.3302023 -0.0061277 -0.0124331 0.0493686 0.8195412 -0.0561286 -0.0304526 -0.2997847 0.2680566 0.0891503 -0.0854578 -0.003587 -0.0204449 -0.0341266 -0.0743086 0.030632 -0.0801063 0.0681527 0.1053476 0.0558899 -0.0314597 0.0223498 0.0328559 0.0948579 0.0394883 0.0863032 -0.01035 0.1001986 -0.0143662 -0.0143384 0.0191414 -0.0324876 -0.0749177 0.0037798 -0.06228 0.0706727 0.0826295 0.0037103 0.0073644 -0.0260182 0.0268953 0.0981336 0.0341316 0.0817123 -0.0007514 0.0449704 0.0102204 0.1170836 -0.0076146 0.1121609 -0.0183031 0.1414937 -0.0375719 -0.0203968 -0.0827032 0.0032529 -0.0848401 0.0303385 0.1123646 0.0088671 -0.1122294 -0.0056445 0.0915488 0.1080559 -0.0313268 -0.0065234 -0.0332815 -0.1059255 -0.0451798 -0.0023046 -0.0348891 0.1015208 -0.0197656 0.0305777 0.0904143 0.0325024 0.0948758 -0.0436577 0.127207 -0.0533556 -0.1236408 -0.0955847 -0.05692 0.0020757 -0.1331588 -0.0959212 -0.0552291 -0.0802008 -0.0702755 0.0690156 -0.0543618 0.055697 0.0006699 0.0975156 -0.0867745 0.1005493 -0.0975002 0.1454911 0.0106575 -0.1436374 0.0811866 -0.105646 0.0133293 -0.0043808 0.0317897 -0.1029188 0.0983854 0.0117573 0.0960775 -0.0330311 -0.0217855 -0.0350017 -0.1303349 -0.0895868 -0.0283725 -0.1266691 -0.0097383 -0.057329 -0.0467471 0.1270224 0.0031474 0.0051549 0.0171788 0.1364829 0.1119076 -0.0498407 unknown
polarizability: 104.5916891|-2.3851638|91.8094081|-3.2235316|-1.5452932|85.4137136 unknown
InChI: InChI=1S/C6H13F3O2Si/c1-10-12(3,11-2)5-4-6(7,8)9/h4-5H2,1-3H3
charge 0 multiplicity 1
25 atoms
Si -1.530612 0.338228 -0.290043
F  3.734853 -0.310653 -0.716486
F  2.758484 -0.981552 1.220057
F  3.054914 1.230004 0.805686
O  -2.57302 0.626152 1.062503
O  -1.812766 -1.224002 -0.993566
C  0.19723 0.390575 0.50877
C  1.337643 0.053496 -0.478416
C  -1.821202 1.531252 -1.727439
C  2.695143 0.000271 0.197283
C  -4.022607 0.791267 1.011122
C  -1.761528 -2.493508 -0.272964
H  0.352274 1.391286 0.952191
H  0.197331 -0.32616 1.35195
H  1.17354 -0.927581 -0.960805
H  1.40874 0.806529 -1.284435
H  -1.147397 1.296555 -2.570346
H  -2.856124 1.443502 -2.102577
H  -1.64916 2.578712 -1.422938
H  -4.3580 0.992861 2.041648
H  -4.523468 -0.124918 0.640498
H  -4.31411 1.644928 0.366309
H  -0.777193 -2.654993 0.213569
H  -1.926688 -3.290856 -1.01611
H  -2.550777 -2.549497 0.501841
