program: Orca
programVersion: 5.0.2
elementType: O O O C C C C C C C C C C C C C C C C C C C C C C C H H H H H H H H H H H H H H H H H H H H H H H H H H
charge: 0
multiplicity: 1
keywords: wb97x-d3
keywords: def2-TZVPP
keywords: def2/J RIJCOSX
keywords: DEFGRID2
keywords: scfconv7
keywords: smallprint printgap noloewdin
keywords: NOSOSCF
formula: C23H26O3
InChI: InChI=1/C23H26O3/c1-16(2)13-20-21(23(20,3)4)22(24)25-15-17-9-8-12-19(14-17)26-18-10-6-5-7-11-18/h5-14,20-21H,15H2,1-4H3
52 atoms
O  -2.018933 2.294637 -0.170179
O  -2.921884 0.767201 -1.526308
O  2.570301 0.191423 0.779517
C  -4.798907 0.00256 0.814446
C  -3.500767 -0.632316 1.177911
C  -3.552469 0.858017 0.788075
C  -5.73732 0.322349 1.955887
C  -5.539109 -0.383327 -0.442998
C  -2.815028 -1.627013 0.321124
C  -2.841635 1.271899 -0.429531
C  -1.548467 -2.012743 0.502388
C  -0.917521 -3.05816 -0.362944
C  -0.679978 -1.44928 1.589744
C  -1.085847 2.67203 -1.191669
C  -0.000839 1.641421 -1.330923
C  0.843201 1.396174 -0.252348
C  0.160175 0.916193 -2.504901
C  1.82509 0.422856 -0.346715
C  1.150523 -0.053013 -2.590425
C  1.981347 -0.317867 -1.512607
C  3.895784 -0.146836 0.678734
C  4.369656 -1.104129 1.564344
C  4.753868 0.478005 -0.217942
C  5.716608 -1.43766 1.552398
C  6.095489 0.124084 -0.227696
C  6.583561 -0.831978 0.653598
H  -3.328337 -0.759134 2.242837
H  -3.439779 1.545545 1.617881
H  -5.198022 0.599522 2.862486
H  -6.36092 -0.542052 2.19145
H  -6.399914 1.149637 1.695188
H  -6.13733 0.454672 -0.804453
H  -6.226751 -1.200183 -0.216139
H  -4.903367 -0.710695 -1.259681
H  -3.386489 -2.085348 -0.479328
H  -0.058763 -2.647397 -0.901149
H  -1.614594 -3.464531 -1.095493
H  -0.535607 -3.887283 0.23848
H  -0.88295 -0.395994 1.785454
H  0.377017 -1.547716 1.342621
H  -0.831982 -1.988606 2.529123
H  -0.677797 3.621932 -0.84913
H  -1.592739 2.847159 -2.141647
H  0.737992 1.959003 0.668038
H  -0.489643 1.103028 -3.350048
H  1.268139 -0.624372 -3.501527
H  2.735434 -1.090891 -1.586573
H  3.689506 -1.579168 2.259933
H  4.389085 1.235357 -0.900192
H  6.08508 -2.18199 2.245945
H  6.76382 0.608775 -0.927263
H  7.631617 -1.099231 0.641899
elementType: O C H
totalener: -1117.85198745 hartree
nucrepener: 2308.09366814 hartree
electener: -3425.94565559 hartree
oneelecener: -6106.69420938 hartree
twoeener: 2680.74855379 hartree
cpcmener: -0.03094633 hartree
kineticenergy: 1112.80802953 hartree
xcener: -110.229398140829 hartree
chargesum: 0.0000000
charge: -0.294443 -0.490141 -0.341876 0.143034 -0.032277 -0.091488 -0.264950 -0.293946 -0.265173 0.386564 -0.022836 -0.220540 -0.305489 0.092008 0.045412 -0.314476 -0.187400 0.292611 -0.138930 -0.208784 0.287813 -0.254843 -0.195289 -0.125149 -0.153158 -0.186253 0.114327 0.094020 0.088000 0.095036 0.096250 0.103381 0.098706 0.087571 0.129151 0.088016 0.090030 0.103770 0.099508 0.092944 0.125005 0.127312 0.114800 0.132595 0.144923 0.161575 0.159532 0.150323 0.157625 0.161488 0.162716 0.161394
qa: -0.2944 -0.4901 -0.3419 0.1430 -0.0323 -0.0915 -0.2650 -0.2939 -0.2652 0.3866 -0.0228 -0.2205 -0.3055 0.0920 0.0454 -0.3145 -0.1874 0.2926 -0.1389 -0.2088 0.2878 -0.2548 -0.1953 -0.1251 -0.1532 -0.1863 0.1143 0.0940 0.0880 0.0950 0.0962 0.1034 0.0987 0.0876 0.1292 0.0880 0.0900 0.1038 0.0995 0.0929 0.1250 0.1273 0.1148 0.1326 0.1449 0.1616 0.1595 0.1503 0.1576 0.1615 0.1627 0.1614
va: 2.1039 1.9970 2.0184 3.7712 3.7862 3.8420 3.8959 3.8875 3.8139 4.1282 3.6727 3.9163 3.9591 3.8020 3.5657 4.0094 3.9229 3.5815 3.8901 3.8875 3.6875 3.9912 3.9131 3.8815 3.8923 3.8962 1.0029 1.0318 1.0042 1.0022 1.0022 0.9993 0.9993 1.0205 1.0005 0.9965 1.0087 0.9950 0.9985 1.0046 0.9973 0.9944 1.0075 1.0259 1.0084 0.9897 0.9971 1.0049 0.9976 0.9887 0.9893 0.9894
dispcorr: -0.028162682 hartree
energy: -1117.880150126948
dipole: -16.99807 17.70675 0.70869 -10.38062 10.47979 0.09917 4.59148 -4.02818 0.56330
magnitude: 0.91070 au
magnitude: 2.31482 debye
