program: Orca
programVersion: 5.0.2
elementType: O O O C C C C C C C C C C C C C C C C C C C C C C C H H H H H H H H H H H H H H H H H H H H H H H H H H
charge: 0
multiplicity: 1
keywords: wb97x-d3
keywords: def2-TZVPP
keywords: def2/J RIJCOSX
keywords: DEFGRID2
keywords: scfconv7
keywords: smallprint printgap noloewdin
keywords: NOSOSCF
formula: C23H26O3
InChI: InChI=1/C23H26O3/c1-16(2)13-20-21(23(20,3)4)22(24)25-15-17-9-8-12-19(14-17)26-18-10-6-5-7-11-18/h5-14,20-21H,15H2,1-4H3
52 atoms
O  -1.627443 1.594369 -0.727749
O  -1.620293 0.646558 1.292229
O  4.100409 -0.181621 -0.101698
C  -4.245999 -0.709147 0.210191
C  -4.721638 0.476268 0.991487
C  -3.61875 0.650433 -0.052042
C  -5.147733 -1.211862 -0.89187
C  -3.464129 -1.813326 0.876865
C  -4.498416 0.640685 2.440118
C  -2.214242 0.940236 0.282841
C  -5.400367 1.079844 3.326331
C  -5.042856 1.192295 4.778901
C  -6.80427 1.495183 3.007325
C  -0.24186 1.88757 -0.610908
C  0.639717 0.682412 -0.802247
C  1.962271 0.762759 -0.377056
C  0.199008 -0.468982 -1.443738
C  2.825983 -0.299465 -0.586772
C  1.072416 -1.531653 -1.636598
C  2.38877 -1.460944 -1.212258
C  5.158716 -0.52617 -0.895985
C  6.256637 -1.100852 -0.270164
C  5.176928 -0.270187 -2.262283
C  7.380915 -1.418346 -1.018454
C  6.305149 -0.60196 -2.998856
C  7.409514 -1.177348 -2.385316
H  -5.659362 0.886729 0.634257
H  -3.942925 1.125053 -0.970815
H  -4.570305 -1.712432 -1.672202
H  -5.708387 -0.402334 -1.361198
H  -5.869896 -1.931543 -0.500288
H  -2.799599 -2.299023 0.159068
H  -4.15516 -2.573037 1.24784
H  -2.858286 -1.489723 1.718404
H  -3.52179 0.374474 2.824327
H  -5.190625 2.213302 5.141313
H  -4.0066 0.914636 4.972001
H  -5.682448 0.552222 5.393256
H  -6.953916 2.552931 3.24048
H  -7.51591 0.942389 3.626323
H  -7.090299 1.343131 1.968333
H  -0.024268 2.376462 0.341606
H  -0.046078 2.616035 -1.39928
H  2.32399 1.654211 0.123278
H  -0.820429 -0.555355 -1.796723
H  0.719787 -2.431306 -2.124308
H  3.058466 -2.29889 -1.360109
H  6.230109 -1.293629 0.795138
H  4.327946 0.188937 -2.753242
H  8.235746 -1.865275 -0.527325
H  6.318486 -0.400602 -4.062366
H  8.286029 -1.431242 -2.966739
elementType: O C H
totalener: -1117.86745784 hartree
nucrepener: 2156.33774512 hartree
electener: -3274.20520296 hartree
oneelecener: -5802.52003305 hartree
twoeener: 2528.31483009 hartree
cpcmener: -0.02634037 hartree
kineticenergy: 1112.79321107 hartree
xcener: -110.227600490151 hartree
chargesum: -0.0000000
charge: -0.298724 -0.459429 -0.330409 0.105154 0.023304 -0.072566 -0.260759 -0.279457 -0.293414 0.368030 -0.052581 -0.219369 -0.255823 0.096094 0.047374 -0.259298 -0.226885 0.240185 -0.134250 -0.183869 0.263938 -0.238429 -0.170187 -0.128112 -0.157900 -0.181169 0.116037 0.096935 0.093257 0.086761 0.094215 0.097296 0.099401 0.096377 0.123333 0.091471 0.088457 0.092437 0.097745 0.093793 0.087581 0.114885 0.125756 0.130528 0.144341 0.157563 0.157753 0.145945 0.153903 0.156403 0.158714 0.157661
qa: -0.2987 -0.4594 -0.3304 0.1052 0.0233 -0.0726 -0.2608 -0.2795 -0.2934 0.3680 -0.0526 -0.2194 -0.2558 0.0961 0.0474 -0.2593 -0.2269 0.2402 -0.1343 -0.1839 0.2639 -0.2384 -0.1702 -0.1281 -0.1579 -0.1812 0.1160 0.0969 0.0933 0.0868 0.0942 0.0973 0.0994 0.0964 0.1233 0.0915 0.0885 0.0924 0.0977 0.0938 0.0876 0.1149 0.1258 0.1305 0.1443 0.1576 0.1578 0.1459 0.1539 0.1564 0.1587 0.1577
va: 2.1119 2.0282 2.0637 3.7126 3.7669 3.8356 3.9090 3.9043 3.8555 4.1195 3.7816 3.9230 3.9393 3.8046 3.6355 4.0902 3.9449 3.7557 3.9082 3.9283 3.7081 3.9939 3.8812 3.8950 3.9033 3.8968 1.0030 1.0299 1.0027 1.0053 1.0019 1.0015 1.0018 1.0142 1.0253 0.9960 1.0091 0.9966 0.9963 0.9975 1.0137 1.0132 0.9904 1.0182 1.0110 0.9918 0.9951 1.0079 0.9985 0.9895 0.9907 0.9904
dispcorr: -0.023285353 hartree
energy: -1117.890743197493
dipole: -34.12963 33.31417 -0.81545 -2.49142 2.48570 -0.00572 10.05101 -11.29857 -1.24756
magnitude: 1.49044 au
magnitude: 3.78840 debye
