program: Orca
programVersion: 5.0.2
elementType: O O O C C C C C C C C C C C C C C C C C C C C C C C H H H H H H H H H H H H H H H H H H H H H H H H H H
charge: 0
multiplicity: 1
keywords: wb97x-d3
keywords: def2-TZVPP
keywords: def2/J RIJCOSX
keywords: DEFGRID2
keywords: scfconv7
keywords: smallprint printgap noloewdin
keywords: NOSOSCF
formula: C23H26O3
InChI: InChI=1/C23H26O3/c1-16(2)13-20-21(23(20,3)4)22(24)25-15-17-9-8-12-19(14-17)26-18-10-6-5-7-11-18/h5-14,20-21H,15H2,1-4H3
52 atoms
O  -0.949905 1.601884 0.982172
O  -1.456392 -0.568192 0.906092
O  3.668598 -0.915239 -2.028199
C  -4.229576 0.544362 -0.066714
C  -4.411398 0.313331 1.401295
C  -3.197559 1.095249 0.904414
C  -5.10867 1.585895 -0.716614
C  -3.895805 -0.599647 -0.990984
C  -4.314382 -1.016947 2.032424
C  -1.817131 0.583624 0.936586
C  -5.172173 -1.518819 2.928671
C  -4.953718 -2.88716 3.503012
C  -6.38825 -0.818327 3.455042
C  0.434704 1.291574 0.897116
C  0.86152 0.864936 -0.482223
C  2.052251 0.16049 -0.610184
C  0.135438 1.196545 -1.622249
C  2.518814 -0.191119 -1.869321
C  0.599791 0.813821 -2.872376
C  1.796767 0.127606 -3.009151
C  4.802995 -0.545968 -1.360564
C  5.67013 -1.563236 -0.984552
C  5.121601 0.783326 -1.106123
C  6.861028 -1.246543 -0.347453
C  6.311427 1.083183 -0.458348
C  7.185074 0.075311 -0.073871
H  -5.135276 0.97585 1.862932
H  -3.258472 2.165393 1.064924
H  -6.059261 1.147027 -1.026999
H  -4.6298 2.001939 -1.605871
H  -5.330738 2.413344 -0.041629
H  -3.333427 -1.403687 -0.524954
H  -3.3199 -0.245895 -1.848692
H  -4.821007 -1.033141 -1.376237
H  -3.479459 -1.643352 1.744696
H  -5.786465 -3.553259 3.260967
H  -4.896933 -2.851617 4.59453
H  -4.03696 -3.348027 3.135244
H  -6.652041 0.086758 2.911003
H  -6.255426 -0.546258 4.505879
H  -7.254654 -1.4833 3.41901
H  0.714462 0.538868 1.637677
H  0.942471 2.217779 1.170233
H  2.61271 -0.115435 0.276242
H  -0.792194 1.74972 -1.551764
H  0.027952 1.066896 -3.755824
H  2.165164 -0.160034 -3.985741
H  5.414545 -2.594724 -1.193328
H  4.457877 1.583152 -1.409405
H  7.53387 -2.043028 -0.056695
H  6.555865 2.118969 -0.260065
H  8.111031 0.318476 0.430372
elementType: O C H
totalener: -1117.86714267 hartree
nucrepener: 2177.04967168 hartree
electener: -3294.91681435 hartree
oneelecener: -5843.88559265 hartree
twoeener: 2548.96877830 hartree
cpcmener: -0.02624249 hartree
kineticenergy: 1112.80128774 hartree
xcener: -110.229270672708 hartree
chargesum: 0.0000000
charge: -0.297827 -0.459752 -0.330456 0.109761 0.026190 -0.074539 -0.261592 -0.280142 -0.300809 0.365671 -0.040926 -0.220977 -0.261852 0.095031 0.045906 -0.206136 -0.243756 0.249622 -0.116696 -0.241301 0.278062 -0.247154 -0.182206 -0.122250 -0.152289 -0.188892 0.114282 0.096361 0.094790 0.092068 0.087495 0.096228 0.097081 0.099500 0.123808 0.092651 0.091516 0.088519 0.089353 0.100470 0.092626 0.115227 0.124851 0.141985 0.144481 0.156516 0.146174 0.145217 0.154248 0.157411 0.158470 0.157981
qa: -0.2978 -0.4598 -0.3305 0.1098 0.0262 -0.0745 -0.2616 -0.2801 -0.3008 0.3657 -0.0409 -0.2210 -0.2619 0.0950 0.0459 -0.2061 -0.2438 0.2496 -0.1167 -0.2413 0.2781 -0.2472 -0.1822 -0.1222 -0.1523 -0.1889 0.1143 0.0964 0.0948 0.0921 0.0875 0.0962 0.0971 0.0995 0.1238 0.0927 0.0915 0.0885 0.0894 0.1005 0.0926 0.1152 0.1249 0.1420 0.1445 0.1565 0.1462 0.1452 0.1542 0.1574 0.1585 0.1580
va: 2.1127 2.0270 2.0702 3.7083 3.7698 3.8514 3.9095 3.9053 3.8643 4.1199 3.7619 3.9251 3.9418 3.8120 3.6112 3.9755 3.9488 3.7359 3.8981 4.0213 3.7047 3.9996 3.8859 3.8902 3.9004 3.9044 1.0044 1.0299 1.0016 1.0028 1.0053 1.0138 1.0020 1.0021 1.0255 0.9966 0.9955 1.0090 1.0111 0.9954 0.9979 1.0127 0.9905 1.0063 1.0104 0.9901 1.0056 1.0085 0.9984 0.9891 0.9907 0.9905
dispcorr: -0.023565792 hartree
energy: -1117.890708458576
dipole: -33.79546 33.23289 -0.56257 -2.52965 3.85915 1.32950 10.45654 -10.11953 0.33701
magnitude: 1.48244 au
magnitude: 3.76805 debye
