program: Orca
programVersion: 5.0.2
elementType: O O O C C C C C C C C C C C C C C C C C C C C C C C H H H H H H H H H H H H H H H H H H H H H H H H H H
charge: 0
multiplicity: 1
keywords: wb97x-d3
keywords: def2-TZVPP
keywords: def2/J RIJCOSX
keywords: DEFGRID2
keywords: scfconv7
keywords: smallprint printgap noloewdin
keywords: NOSOSCF
formula: C23H26O3
InChI: InChI=1/C23H26O3/c1-16(2)13-20-21(23(20,3)4)22(24)25-15-17-9-8-12-19(14-17)26-18-10-6-5-7-11-18/h5-14,20-21H,15H2,1-4H3
52 atoms
O  -1.114209 1.895749 0.659306
O  -1.235309 -0.312037 0.941648
O  3.483847 -0.910478 -1.981937
C  -4.168878 0.173953 -0.109493
C  -4.292065 0.095275 1.380912
C  -3.240768 1.009874 0.757354
C  -5.228713 0.957972 -0.846135
C  -3.644703 -0.995264 -0.904804
C  -3.959645 -1.110446 2.164443
C  -1.791246 0.75152 0.808173
C  -4.682359 -1.609631 3.174468
C  -4.227127 -2.841391 3.900185
C  -5.965198 -1.03421 3.694086
C  0.305073 1.810156 0.572427
C  0.769788 1.210488 -0.726742
C  1.909447 0.417847 -0.735175
C  0.101569 1.469636 -1.92067
C  2.389593 -0.091684 -1.935554
C  0.575923 0.932222 -3.107025
C  1.72655 0.157077 -3.126759
C  4.607438 -0.591745 -1.270697
C  5.334848 -1.647119 -0.73725
C  5.049553 0.718057 -1.123894
C  6.512782 -1.387935 -0.051748
C  6.223793 0.962129 -0.426056
C  6.959881 -0.084174 0.113218
H  -5.117195 0.674224 1.780259
H  -3.485651 2.065176 0.790517
H  -5.59812 1.798358 -0.25663
H  -6.082405 0.320048 -1.084693
H  -4.839523 1.356225 -1.785668
H  -2.926025 -1.612707 -0.37316
H  -3.167283 -0.650412 -1.824412
H  -4.47746 -1.640741 -1.19135
H  -3.053915 -1.640236 1.897693
H  -4.097659 -2.641168 4.967618
H  -3.281763 -3.224151 3.515328
H  -4.969205 -3.641131 3.826265
H  -5.842024 -0.682408 4.722251
H  -6.741705 -1.802932 3.725187
H  -6.353497 -0.20473 3.106592
H  0.717499 1.263769 1.423341
H  0.646324 2.843295 0.651716
H  2.4161 0.194655 0.196982
H  -0.788344 2.086109 -1.932828
H  0.052686 1.129375 -4.03377
H  2.10288 -0.255165 -4.054476
H  4.980882 -2.662919 -0.862297
H  4.49308 1.543707 -1.549478
H  7.078288 -2.213203 0.361513
H  6.566282 1.98255 -0.310957
H  7.875546 0.115104 0.654161
elementType: O C H
totalener: -1117.86726174 hartree
nucrepener: 2187.25764716 hartree
electener: -3305.12490891 hartree
oneelecener: -5864.49333423 hartree
twoeener: 2559.36842532 hartree
cpcmener: -0.02602602 hartree
kineticenergy: 1112.79921562 hartree
xcener: -110.227896236090 hartree
chargesum: -0.0000000
charge: -0.295090 -0.462067 -0.330869 0.104986 0.027293 -0.080552 -0.261571 -0.280456 -0.295610 0.377483 -0.050616 -0.219366 -0.258068 0.103547 0.049092 -0.203327 -0.258519 0.256557 -0.111314 -0.246234 0.275956 -0.247226 -0.182319 -0.122765 -0.151257 -0.186809 0.116278 0.095717 0.086898 0.094632 0.092706 0.095888 0.097153 0.099666 0.123792 0.091464 0.088160 0.092356 0.098361 0.093405 0.088426 0.113386 0.120020 0.141985 0.140857 0.156938 0.145977 0.145818 0.154899 0.157614 0.159149 0.157576
qa: -0.2951 -0.4621 -0.3309 0.1050 0.0273 -0.0806 -0.2616 -0.2805 -0.2956 0.3775 -0.0506 -0.2194 -0.2581 0.1035 0.0491 -0.2033 -0.2585 0.2566 -0.1113 -0.2462 0.2760 -0.2472 -0.1823 -0.1228 -0.1513 -0.1868 0.1163 0.0957 0.0869 0.0946 0.0927 0.0959 0.0972 0.0997 0.1238 0.0915 0.0882 0.0924 0.0984 0.0934 0.0884 0.1134 0.1200 0.1420 0.1409 0.1569 0.1460 0.1458 0.1549 0.1576 0.1591 0.1576
va: 2.1137 2.0300 2.0709 3.7140 3.7551 3.8424 3.9092 3.9079 3.8561 4.1275 3.7773 3.9236 3.9397 3.8055 3.6043 3.9679 3.9539 3.7299 3.8892 4.0232 3.7059 4.0014 3.8914 3.8884 3.8990 3.9042 1.0033 1.0301 1.0054 1.0017 1.0028 1.0137 1.0016 1.0016 1.0257 0.9958 1.0090 0.9968 0.9960 0.9977 1.0131 1.0124 0.9912 1.0071 1.0138 0.9891 1.0059 1.0083 0.9980 0.9891 0.9904 0.9906
dispcorr: -0.023481451 hartree
energy: -1117.890743195918
dipole: -31.72328 31.07985 -0.64343 -4.90469 6.12797 1.22328 11.52877 -11.36516 0.16360
magnitude: 1.39182 au
magnitude: 3.53773 debye
