program: Orca
programVersion: 5.0.2
elementType: O O O C C C C C C C C C C C C C C C C C C C C C C C H H H H H H H H H H H H H H H H H H H H H H H H H H
charge: 0
multiplicity: 1
keywords: wb97x-d3
keywords: def2-TZVPP
keywords: def2/J RIJCOSX
keywords: DEFGRID2
keywords: scfconv7
keywords: smallprint printgap noloewdin
keywords: NOSOSCF
formula: C23H26O3
InChI: InChI=1/C23H26O3/c1-16(2)13-20-21(23(20,3)4)22(24)25-15-17-9-8-12-19(14-17)26-18-10-6-5-7-11-18/h5-14,20-21H,15H2,1-4H3
52 atoms
O  -2.172317 1.64996 -1.592508
O  -2.362088 -0.570219 -1.498769
O  3.227346 -0.883944 -1.352481
C  -5.032268 -0.17008 -0.00396
C  -4.101292 0.423603 1.012875
C  -4.017264 0.841156 -0.465865
C  -6.45432 0.342908 0.018845
C  -4.956814 -1.631715 -0.3751
C  -3.004923 -0.328846 1.64867
C  -2.797909 0.523066 -1.232848
C  -2.53248 -0.149386 2.888362
C  -1.384256 -0.975909 3.38727
C  -3.045854 0.852413 3.877671
C  -0.886029 1.517112 -2.190585
C  0.154791 1.035369 -1.215224
C  1.232283 0.297679 -1.688353
C  0.085529 1.35645 0.137333
C  2.226757 -0.124744 -0.816477
C  1.075273 0.912516 1.001371
C  2.150498 0.16798 0.539364
C  4.489551 -0.826773 -0.82499
C  5.124443 0.385247 -0.58085
C  5.144859 -2.02763 -0.597123
C  6.422569 0.383761 -0.092838
C  6.448523 -2.014045 -0.120228
C  7.090098 -0.811678 0.140713
H  -4.542376 1.199273 1.627978
H  -4.396232 1.83825 -0.6616
H  -6.505418 1.400507 0.282303
H  -7.051622 -0.208634 0.747735
H  -6.928182 0.222126 -0.957812
H  -3.9704 -2.073597 -0.276126
H  -5.28535 -1.785437 -1.404723
H  -5.633224 -2.197153 0.269168
H  -2.523604 -1.093103 1.048512
H  -1.680045 -1.587107 4.24469
H  -0.565429 -0.339553 3.734193
H  -0.989183 -1.642088 2.62016
H  -2.282586 1.604958 4.091444
H  -3.272559 0.368266 4.830642
H  -3.943145 1.376666 3.557028
H  -0.640753 2.520962 -2.540004
H  -0.926917 0.867367 -3.067585
H  1.298722 0.0379 -2.738874
H  -0.735627 1.943558 0.527663
H  1.011674 1.148894 2.055781
H  2.90693 -0.179326 1.231341
H  4.616802 1.32278 -0.771706
H  4.639378 -2.964511 -0.795841
H  6.916881 1.32766 0.098169
H  6.959445 -2.952101 0.054889
H  8.104394 -0.804736 0.517503
elementType: O C H
totalener: -1117.86615132 hartree
nucrepener: 2235.59987292 hartree
electener: -3353.46602425 hartree
oneelecener: -5961.27229737 hartree
twoeener: 2607.80627312 hartree
cpcmener: -0.02644070 hartree
kineticenergy: 1112.79574040 hartree
xcener: -110.228039157710 hartree
chargesum: -0.0000000
charge: -0.292008 -0.450973 -0.328738 0.117207 0.047459 -0.097776 -0.266267 -0.278052 -0.314580 0.370961 -0.052540 -0.229735 -0.257597 0.095386 0.068398 -0.275803 -0.256001 0.277761 -0.154458 -0.184967 0.260203 -0.178342 -0.232487 -0.149256 -0.130133 -0.176588 0.112763 0.098152 0.086228 0.095447 0.093679 0.094755 0.099577 0.092244 0.121703 0.108198 0.086287 0.091611 0.097922 0.096206 0.090071 0.121560 0.114876 0.128574 0.144687 0.162507 0.153612 0.156971 0.146662 0.158919 0.157585 0.158127
qa: -0.2920 -0.4510 -0.3287 0.1172 0.0475 -0.0978 -0.2663 -0.2781 -0.3146 0.3710 -0.0525 -0.2297 -0.2576 0.0954 0.0684 -0.2758 -0.2560 0.2778 -0.1545 -0.1850 0.2602 -0.1783 -0.2325 -0.1493 -0.1301 -0.1766 0.1128 0.0982 0.0862 0.0954 0.0937 0.0948 0.0996 0.0922 0.1217 0.1082 0.0863 0.0916 0.0979 0.0962 0.0901 0.1216 0.1149 0.1286 0.1447 0.1625 0.1536 0.1570 0.1467 0.1589 0.1576 0.1581
va: 2.1098 2.0468 2.0705 3.7317 3.7367 3.8213 3.9049 3.8946 3.8492 4.1578 3.7612 3.9179 3.9400 3.7995 3.6237 4.0939 3.9317 3.7359 3.8895 3.9077 3.7089 3.9120 4.0025 3.8936 3.8881 3.8976 1.0023 1.0286 1.0046 1.0020 1.0023 1.0129 1.0005 1.0014 1.0186 0.9986 0.9965 1.0082 0.9966 0.9973 1.0131 0.9916 1.0116 1.0205 1.0127 0.9867 0.9986 0.9964 1.0072 0.9904 0.9894 0.9903
dispcorr: -0.025589027 hartree
energy: -1117.891740350524
dipole: -23.49573 23.42014 -0.07559 -0.76004 1.97343 1.21339 17.07043 -16.10330 0.96713
magnitude: 1.55351 au
magnitude: 3.94870 debye
