program: Orca
programVersion: 5.0.2
elementType: O O O C C C C C C C C C C C C C C C C C C C C C C C H H H H H H H H H H H H H H H H H H H H H H H H H H
charge: 0
multiplicity: 1
keywords: wb97x-d3
keywords: def2-TZVPP
keywords: def2/J RIJCOSX
keywords: DEFGRID2
keywords: scfconv7
keywords: smallprint printgap noloewdin
keywords: NOSOSCF
formula: C23H26O3
InChI: InChI=1/C23H26O3/c1-16(2)13-20-21(23(20,3)4)22(24)25-15-17-9-8-12-19(14-17)26-18-10-6-5-7-11-18/h5-14,20-21H,15H2,1-4H3
52 atoms
O  -1.680097 1.977466 0.345516
O  -0.659255 0.049383 0.830125
O  3.544779 0.876115 -1.483608
C  -3.025533 -1.287168 -0.67961
C  -3.493281 -1.170677 0.729063
C  -2.919646 0.056849 0.022919
C  -4.076627 -1.349169 -1.762564
C  -1.794296 -2.094337 -1.01176
C  -2.797775 -1.84729 1.853318
C  -1.635941 0.644313 0.441279
C  -2.671914 -1.359721 3.089385
C  -1.972645 -2.132369 4.165451
C  -3.177603 -0.011615 3.500918
C  -0.485039 2.715315 0.638151
C  0.479893 2.631797 -0.509358
C  1.601697 1.818997 -0.424856
C  0.221974 3.329629 -1.686773
C  2.43452 1.673591 -1.526464
C  1.078268 3.203288 -2.768858
C  2.181783 2.363877 -2.701496
C  3.467289 -0.355984 -0.892902
C  4.592526 -0.798767 -0.211358
C  2.340597 -1.164573 -0.999325
C  4.589226 -2.060172 0.36696
C  2.348844 -2.418998 -0.406975
C  3.467745 -2.873255 0.278448
H  -4.571592 -1.09414 0.848822
H  -3.654078 0.792375 -0.284047
H  -4.40051 -2.379418 -1.924825
H  -3.686278 -0.971629 -2.709923
H  -4.960306 -0.761442 -1.50965
H  -1.297647 -1.692486 -1.897321
H  -2.085719 -3.12163 -1.240798
H  -1.064065 -2.134659 -0.208681
H  -2.387637 -2.831711 1.644891
H  -1.119825 -1.570558 4.556182
H  -1.604906 -3.094774 3.809452
H  -2.635717 -2.3167 5.01485
H  -2.346798 0.642633 3.780174
H  -3.814333 -0.090597 4.386008
H  -3.751831 0.490796 2.724353
H  -0.033482 2.37173 1.57014
H  -0.825896 3.739186 0.787199
H  1.812196 1.287573 0.494804
H  -0.646102 3.974032 -1.756224
H  0.881586 3.751071 -3.681308
H  2.841525 2.246891 -3.552097
H  5.46404 -0.160135 -0.138018
H  1.46254 -0.830011 -1.537452
H  5.468643 -2.402511 0.897294
H  1.469386 -3.045249 -0.488572
H  3.465441 -3.85278 0.738069
elementType: O C H
totalener: -1117.86547102 hartree
nucrepener: 2325.86629790 hartree
electener: -3443.73176893 hartree
oneelecener: -6142.16694479 hartree
twoeener: 2698.43517587 hartree
cpcmener: -0.02534900 hartree
kineticenergy: 1112.81504492 hartree
xcener: -110.228547129806 hartree
chargesum: -0.0000000
charge: -0.292858 -0.468199 -0.333305 0.144883 -0.016941 -0.111579 -0.264871 -0.311239 -0.276230 0.402195 -0.017522 -0.223424 -0.266909 0.084803 -0.006883 -0.162782 -0.234005 0.251199 -0.119035 -0.239040 0.293503 -0.249534 -0.203846 -0.123147 -0.142543 -0.190161 0.112828 0.093829 0.093398 0.095165 0.086078 0.103151 0.102314 0.085531 0.121596 0.094151 0.088089 0.094930 0.098611 0.106677 0.093879 0.113302 0.126421 0.140318 0.142597 0.157832 0.146309 0.144685 0.159025 0.157299 0.162376 0.157079
qa: -0.2929 -0.4682 -0.3333 0.1449 -0.0169 -0.1116 -0.2649 -0.3112 -0.2762 0.4022 -0.0175 -0.2234 -0.2669 0.0848 -0.0069 -0.1628 -0.2340 0.2512 -0.1190 -0.2390 0.2935 -0.2495 -0.2038 -0.1231 -0.1425 -0.1902 0.1128 0.0938 0.0934 0.0952 0.0861 0.1032 0.1023 0.0855 0.1216 0.0942 0.0881 0.0949 0.0986 0.1067 0.0939 0.1133 0.1264 0.1403 0.1426 0.1578 0.1463 0.1447 0.1590 0.1573 0.1624 0.1571
va: 2.1098 2.0131 2.0781 3.7159 3.8340 3.8122 3.9024 3.9081 3.8578 4.0858 3.7058 3.9260 3.9441 3.8178 3.6082 3.8817 3.9779 3.7473 3.8867 4.0221 3.7059 4.0054 3.8906 3.8898 3.8869 3.9257 1.0051 1.0312 1.0025 1.0021 1.0053 0.9984 1.0004 1.0076 1.0009 0.9966 1.0073 0.9969 0.9985 0.9992 1.0057 1.0096 0.9925 1.0202 1.0052 0.9887 1.0057 1.0086 0.9929 0.9888 0.9879 0.9914
dispcorr: -0.027029016 hartree
energy: -1117.892500039068
dipole: -21.07059 19.84827 -1.22232 -12.44272 12.76171 0.31899 9.71427 -9.67946 0.03480
magnitude: 1.26373 au
magnitude: 3.21216 debye
