program: Orca
programVersion: 5.0.2
elementType: O O O C C C C C C C C C C C C C C C C C C C C C C C H H H H H H H H H H H H H H H H H H H H H H H H H H
charge: 0
multiplicity: 1
keywords: wb97x-d3
keywords: def2-TZVPP
keywords: def2/J RIJCOSX
keywords: DEFGRID2
keywords: scfconv7
keywords: smallprint printgap noloewdin
keywords: NOSOSCF
formula: C23H26O3
InChI: InChI=1/C23H26O3/c1-16(2)13-20-21(23(20,3)4)22(24)25-15-17-9-8-12-19(14-17)26-18-10-6-5-7-11-18/h5-14,20-21H,15H2,1-4H3
52 atoms
O  -1.05534 0.879711 -1.521805
O  -1.700159 1.585104 0.493858
O  4.045876 0.654581 -0.557445
C  -1.815279 -1.470236 1.142805
C  -3.208028 -1.143749 0.700127
C  -2.018263 -0.709873 -0.156171
C  -1.357781 -2.899849 0.976165
C  -1.214557 -0.804669 2.355441
C  -4.090879 -0.192202 1.400823
C  -1.601596 0.694172 -0.316085
C  -5.389222 -0.407454 1.640412
C  -6.22279 0.621488 2.341232
C  -6.123044 -1.653069 1.220118
C  -0.468246 2.155656 -1.792219
C  0.819243 2.340737 -1.039467
C  1.820373 1.380528 -1.158989
C  1.021034 3.455246 -0.236734
C  3.007908 1.535023 -0.458866
C  2.223616 3.611621 0.439066
C  3.217042 2.651823 0.341938
C  3.824457 -0.673771 -0.800279
C  4.657345 -1.293765 -1.72063
C  2.859806 -1.401794 -0.113329
C  4.525537 -2.655414 -1.953587
C  2.730678 -2.759544 -0.366565
C  3.559011 -3.392388 -1.284142
H  -3.732292 -1.976787 0.243897
H  -1.874495 -1.300912 -1.053034
H  -1.643949 -3.498965 1.843217
H  -0.270617 -2.953658 0.88178
H  -1.790588 -3.36868 0.091382
H  -1.594752 0.192579 2.555314
H  -0.129174 -0.732512 2.257172
H  -1.421086 -1.413029 3.238371
H  -3.661003 0.740533 1.743808
H  -7.073284 0.923567 1.723174
H  -5.653415 1.517546 2.588832
H  -6.644877 0.222262 3.267732
H  -5.555251 -2.564366 1.410318
H  -6.361696 -1.637894 0.153288
H  -7.070476 -1.746947 1.751839
H  -1.169531 2.963912 -1.577034
H  -0.289291 2.149993 -2.867526
H  1.669152 0.52129 -1.801867
H  0.239899 4.198344 -0.136061
H  2.382955 4.480232 1.064751
H  4.150542 2.764333 0.879006
H  5.407315 -0.714085 -2.244249
H  2.215866 -0.922833 0.614285
H  5.179031 -3.137246 -2.669428
H  1.978683 -3.32731 0.166552
H  3.453456 -4.452672 -1.472544
elementType: O C H
totalener: -1117.86582094 hartree
nucrepener: 2270.08532669 hartree
electener: -3387.95114762 hartree
oneelecener: -6029.85970081 hartree
twoeener: 2641.90855319 hartree
cpcmener: -0.02541503 hartree
kineticenergy: 1112.80286815 hartree
xcener: -110.227475771562 hartree
chargesum: 0.0000000
charge: -0.292396 -0.466589 -0.328290 0.106665 0.041972 -0.093975 -0.259232 -0.280739 -0.329103 0.389580 -0.009252 -0.222671 -0.292474 0.095112 0.023644 -0.246001 -0.219744 0.295303 -0.108752 -0.261873 0.285578 -0.242333 -0.209679 -0.123435 -0.153977 -0.184005 0.113602 0.094703 0.096317 0.080964 0.088337 0.098132 0.097008 0.098530 0.121906 0.097211 0.085419 0.092814 0.098498 0.107304 0.095553 0.112096 0.123823 0.138443 0.141064 0.156726 0.145656 0.145288 0.167544 0.157770 0.174666 0.157293
qa: -0.2924 -0.4666 -0.3283 0.1067 0.0420 -0.0940 -0.2592 -0.2807 -0.3291 0.3896 -0.0093 -0.2227 -0.2925 0.0951 0.0236 -0.2460 -0.2197 0.2953 -0.1088 -0.2619 0.2856 -0.2423 -0.2097 -0.1234 -0.1540 -0.1840 0.1136 0.0947 0.0963 0.0810 0.0883 0.0981 0.0970 0.0985 0.1219 0.0972 0.0854 0.0928 0.0985 0.1073 0.0956 0.1121 0.1238 0.1384 0.1411 0.1567 0.1457 0.1453 0.1675 0.1578 0.1747 0.1573
va: 2.1131 2.0283 2.0827 3.6994 3.7585 3.8750 3.9170 3.9064 3.9023 4.1189 3.7072 3.9268 3.9477 3.8140 3.6358 3.9342 3.9576 3.7085 3.8961 4.0098 3.7108 4.0057 3.9344 3.8882 3.8829 3.9256 1.0009 1.0298 1.0034 1.0077 1.0051 1.0141 1.0017 1.0012 1.0251 0.9929 1.0102 0.9942 0.9982 0.9933 1.0031 1.0097 0.9929 1.0163 1.0058 0.9892 1.0074 1.0083 0.9865 0.9889 0.9816 0.9921
dispcorr: -0.025243767 hartree
energy: -1117.891064702010
dipole: -27.44740 27.00290 -0.44449 -12.25787 11.15450 -1.10337 11.75418 -12.32810 -0.57392
magnitude: 1.32075 au
magnitude: 3.35708 debye
