program: Orca
programVersion: 5.0.2
elementType: O O O C C C C C C C C C C C C C C C C C C C C C C C H H H H H H H H H H H H H H H H H H H H H H H H H H
charge: 0
multiplicity: 1
keywords: wb97x-d3
keywords: def2-TZVPP
keywords: def2/J RIJCOSX
keywords: DEFGRID2
keywords: scfconv7
keywords: smallprint printgap noloewdin
keywords: NOSOSCF
formula: C23H26O3
InChI: InChI=1/C23H26O3/c1-16(2)13-20-21(23(20,3)4)22(24)25-15-17-9-8-12-19(14-17)26-18-10-6-5-7-11-18/h5-14,20-21H,15H2,1-4H3
52 atoms
O  -1.040181 -1.418498 0.470987
O  -2.565039 -0.595801 1.890359
O  4.186672 0.75513 0.086459
C  -4.637938 -1.123396 -0.350757
C  -4.054467 0.209459 -0.668245
C  -3.12927 -0.987848 -0.404279
C  -5.233176 -1.902786 -1.500791
C  -5.365773 -1.363969 0.948896
C  -4.135658 1.366348 0.256035
C  -2.2618 -0.974398 0.783878
C  -3.332037 2.431469 0.197798
C  -3.516269 3.603508 1.111122
C  -2.203193 2.546844 -0.782045
C  -0.009328 -1.402478 1.467441
C  0.851228 -0.180266 1.310116
C  2.116267 -0.305696 0.746634
C  0.394592 1.074235 1.708938
C  2.915079 0.819191 0.575939
C  1.199381 2.188815 1.530746
C  2.457832 2.071795 0.95987
C  4.542633 -0.218079 -0.808666
C  3.803617 -0.455727 -1.96133
C  5.712655 -0.919182 -0.558423
C  4.247457 -1.411024 -2.863679
C  6.150813 -1.864511 -1.475387
C  5.418925 -2.118713 -2.626498
H  -4.063498 0.477765 -1.72136
H  -2.657563 -1.402937 -1.287273
H  -4.705465 -1.717726 -2.437524
H  -6.278937 -1.626137 -1.65035
H  -5.198907 -2.976689 -1.306324
H  -5.002047 -0.770221 1.782018
H  -5.294591 -2.41456 1.237306
H  -6.425311 -1.133773 0.818725
H  -4.93034 1.358875 0.995817
H  -4.374693 3.48198 1.771831
H  -3.656526 4.527441 0.543128
H  -2.62979 3.756592 1.732934
H  -1.342889 3.046118 -0.331552
H  -2.495053 3.15361 -1.644544
H  -1.866226 1.581704 -1.159118
H  0.575356 -2.305788 1.296395
H  -0.435166 -1.462831 2.469055
H  2.474432 -1.285972 0.454939
H  -0.579317 1.18409 2.167317
H  0.845189 3.163899 1.839525
H  3.086442 2.942569 0.821411
H  2.894921 0.099527 -2.15944
H  6.279176 -0.719993 0.342745
H  3.673305 -1.597093 -3.762244
H  7.066424 -2.408404 -1.281614
H  5.760951 -2.85924 -3.337529
elementType: O C H
totalener: -1117.86547499 hartree
nucrepener: 2243.30672690 hartree
electener: -3361.17220189 hartree
oneelecener: -5976.33785156 hartree
twoeener: 2615.16564967 hartree
cpcmener: -0.02436093 hartree
kineticenergy: 1112.80249087 hartree
xcener: -110.225987264892 hartree
chargesum: -0.0000000
charge: -0.290499 -0.468792 -0.328253 0.137538 -0.030091 -0.102878 -0.262193 -0.300410 -0.258638 0.394444 -0.019581 -0.218209 -0.284439 0.076567 0.013192 -0.202215 -0.233281 0.272900 -0.132548 -0.232036 0.270497 -0.188086 -0.236785 -0.143388 -0.126716 -0.179091 0.113168 0.092742 0.085998 0.093564 0.095394 0.094373 0.100301 0.098155 0.121755 0.087666 0.097224 0.090688 0.086635 0.119109 0.095790 0.111476 0.115840 0.140349 0.152329 0.156309 0.146148 0.157261 0.146189 0.159256 0.157396 0.157878
qa: -0.2905 -0.4688 -0.3283 0.1375 -0.0301 -0.1029 -0.2622 -0.3004 -0.2586 0.3944 -0.0196 -0.2182 -0.2844 0.0766 0.0132 -0.2022 -0.2333 0.2729 -0.1325 -0.2320 0.2705 -0.1881 -0.2368 -0.1434 -0.1267 -0.1791 0.1132 0.0927 0.0860 0.0936 0.0954 0.0944 0.1003 0.0982 0.1218 0.0877 0.0972 0.0907 0.0866 0.1191 0.0958 0.1115 0.1158 0.1403 0.1523 0.1563 0.1461 0.1573 0.1462 0.1593 0.1574 0.1579
va: 2.1141 2.0169 2.0744 3.7510 3.8146 3.8439 3.8971 3.8948 3.8399 4.1127 3.6931 3.9247 3.9457 3.8070 3.6867 3.9580 3.8792 3.7383 3.9005 4.0107 3.7030 3.9239 4.0087 3.8894 3.8843 3.9013 1.0031 1.0320 1.0046 1.0025 1.0025 1.0181 1.0002 0.9987 1.0010 1.0084 0.9949 0.9968 1.0027 0.9980 1.0032 1.0034 1.0164 1.0081 1.0148 0.9916 1.0065 0.9970 1.0073 0.9901 0.9895 0.9904
dispcorr: -0.025728815 hartree
energy: -1117.891203807727
dipole: -27.66970 27.75662 0.08692 4.03068 -4.44493 -0.41425 -3.98522 2.82189 -1.16333
magnitude: 1.23794 au
magnitude: 3.14659 debye
