program: Orca
programVersion: 5.0.2
elementType: O O O C C C C C C C C C C C C C C C C C C C C C C C H H H H H H H H H H H H H H H H H H H H H H H H H H
charge: 0
multiplicity: 1
keywords: wb97x-d3
keywords: def2-TZVPP
keywords: def2/J RIJCOSX
keywords: DEFGRID2
keywords: scfconv7
keywords: smallprint printgap noloewdin
keywords: NOSOSCF
formula: C23H26O3
InChI: InChI=1/C23H26O3/c1-16(2)13-20-21(23(20,3)4)22(24)25-15-17-9-8-12-19(14-17)26-18-10-6-5-7-11-18/h5-14,20-21H,15H2,1-4H3
52 atoms
O  -1.726597 1.850326 -0.838734
O  -1.062588 1.014278 1.123176
O  2.981933 0.495743 -2.049697
C  -1.896406 -1.693317 -0.279282
C  -3.052897 -1.316782 0.592453
C  -2.45398 -0.280239 -0.356296
C  -2.195451 -2.559435 -1.47992
C  -0.533202 -1.95949 0.308845
C  -2.966643 -1.229725 2.061941
C  -1.680229 0.888593 0.093631
C  -3.934803 -1.567466 2.922342
C  -3.708831 -1.459009 4.401078
C  -5.29599 -2.070345 2.548574
C  -0.987467 3.041293 -0.616446
C  0.482682 2.904671 -0.915481
C  1.055499 1.719058 -1.350254
C  1.287426 4.033925 -0.765519
C  2.420532 1.667336 -1.60727
C  2.641014 3.97416 -1.047856
C  3.224003 2.783301 -1.464479
C  3.001227 -0.577687 -1.204537
C  3.044015 -1.835889 -1.794103
C  3.019643 -0.446695 0.179301
C  3.111553 -2.965595 -0.992912
C  3.082937 -1.58839 0.967169
C  3.128867 -2.849833 0.39107
H  -4.00884 -1.668445 0.221429
H  -3.051371 -0.080524 -1.238193
H  -2.167674 -3.616456 -1.206538
H  -1.458043 -2.402122 -2.270068
H  -3.181267 -2.351684 -1.897974
H  0.243106 -1.776025 -0.436734
H  -0.462293 -3.008947 0.601872
H  -0.296648 -1.362396 1.184841
H  -2.031116 -0.885389 2.484676
H  -3.837665 -2.428056 4.891475
H  -4.435767 -0.783601 4.860755
H  -2.711185 -1.091486 4.641778
H  -5.462579 -3.06785 2.964308
H  -5.472795 -2.129496 1.47662
H  -6.071761 -1.428485 2.974672
H  -1.132605 3.406674 0.403282
H  -1.431242 3.77743 -1.287871
H  0.465256 0.824756 -1.507909
H  0.848982 4.966304 -0.429301
H  3.254624 4.858317 -0.933711
H  4.284457 2.725255 -1.674177
H  3.027784 -1.925097 -2.873362
H  2.992136 0.52784 0.649997
H  3.144662 -3.942872 -1.457351
H  3.098819 -1.482949 2.044475
H  3.177766 -3.733428 1.013575
elementType: O C H
totalener: -1117.86755106 hartree
nucrepener: 2313.52647368 hartree
electener: -3431.39402474 hartree
oneelecener: -6117.10603205 hartree
twoeener: 2685.71200731 hartree
cpcmener: -0.02584301 hartree
kineticenergy: 1112.79133576 hartree
xcener: -110.229382756122 hartree
chargesum: -0.0000000
charge: -0.294175 -0.454877 -0.332872 0.140454 0.022263 -0.076201 -0.264182 -0.293889 -0.286795 0.354890 -0.060564 -0.217785 -0.255461 0.079552 0.015810 -0.173028 -0.213743 0.210179 -0.132246 -0.202674 0.268577 -0.215584 -0.175110 -0.131395 -0.170204 -0.183387 0.118456 0.096420 0.095193 0.093937 0.088359 0.066404 0.106861 0.101607 0.119146 0.091664 0.092240 0.088543 0.096476 0.087661 0.094956 0.118427 0.130831 0.146879 0.142912 0.157580 0.147119 0.142906 0.149255 0.155366 0.157608 0.155642
qa: -0.2942 -0.4549 -0.3329 0.1405 0.0223 -0.0762 -0.2642 -0.2939 -0.2868 0.3549 -0.0606 -0.2178 -0.2555 0.0796 0.0158 -0.1730 -0.2137 0.2102 -0.1322 -0.2027 0.2686 -0.2156 -0.1751 -0.1314 -0.1702 -0.1834 0.1185 0.0964 0.0952 0.0939 0.0884 0.0664 0.1069 0.1016 0.1191 0.0917 0.0922 0.0885 0.0965 0.0877 0.0950 0.1184 0.1308 0.1469 0.1429 0.1576 0.1471 0.1429 0.1493 0.1554 0.1576 0.1556
va: 2.1149 2.0316 2.0655 3.7118 3.7689 3.8321 3.9040 3.8987 3.8482 4.1361 3.7937 3.9220 3.9384 3.8318 3.6566 3.9587 3.9633 3.7937 3.8811 3.9855 3.6892 3.9549 3.8343 3.8870 3.8725 3.8641 1.0000 1.0301 1.0015 1.0016 1.0060 1.0103 1.0028 1.0105 1.0236 0.9962 0.9964 1.0090 0.9965 1.0147 0.9973 1.0113 0.9912 1.0009 0.9994 0.9894 1.0036 1.0092 1.0031 0.9898 0.9921 0.9917
dispcorr: -0.027085096 hartree
energy: -1117.894636153412
dipole: -20.55637 19.67544 -0.88093 -16.55230 16.48712 -0.06518 12.90398 -13.14180 -0.23782
magnitude: 0.91479 au
magnitude: 2.32522 debye
