program: Orca
programVersion: 5.0.2
elementType: O O O C C C C C C C C C C C C C C C C C C C C C C C H H H H H H H H H H H H H H H H H H H H H H H H H H
charge: 0
multiplicity: 1
keywords: wb97x-d3
keywords: def2-TZVPP
keywords: def2/J RIJCOSX
keywords: DEFGRID2
keywords: scfconv7
keywords: smallprint printgap noloewdin
keywords: NOSOSCF
formula: C23H26O3
InChI: InChI=1/C23H26O3/c1-16(2)13-20-21(23(20,3)4)22(24)25-15-17-9-8-12-19(14-17)26-18-10-6-5-7-11-18/h5-14,20-21H,15H2,1-4H3
52 atoms
O  -1.924003 1.428209 -1.809694
O  -0.9682 -0.531904 -1.332314
O  3.524978 1.140797 -0.199083
C  -3.74853 -1.337755 -0.195429
C  -3.087643 -0.645982 0.956105
C  -3.123309 0.022232 -0.42573
C  -5.259502 -1.344438 -0.206919
C  -3.158203 -2.594152 -0.786085
C  -1.839788 -1.118033 1.583634
C  -1.896252 0.233128 -1.213541
C  -1.58612 -1.067958 2.896097
C  -0.282301 -1.561022 3.444594
C  -2.54555 -0.509142 3.912947
C  -0.750983 1.848942 -2.52141
C  0.318723 2.282938 -1.560472
C  1.451877 1.504381 -1.369798
C  0.14935 3.448485 -0.817306
C  2.391114 1.873281 -0.415319
C  1.105779 3.821497 0.113018
C  2.225596 3.030476 0.33006
C  3.466657 -0.225405 -0.168566
C  4.57599 -0.908073 -0.64947
C  2.385163 -0.919025 0.363804
C  4.603405 -2.294055 -0.596099
C  2.422082 -2.305796 0.396105
C  3.525476 -3.00018 -0.080647
H  -3.775301 -0.164147 1.642759
H  -3.827194 0.842868 -0.501922
H  -5.643651 -2.186747 0.372364
H  -5.642904 -1.440231 -1.225064
H  -5.676645 -0.431652 0.22076
H  -3.577972 -3.462547 -0.274146
H  -2.077613 -2.663368 -0.707592
H  -3.419398 -2.681937 -1.842559
H  -1.078526 -1.542784 0.940998
H  -0.43805 -2.365186 4.1691
H  0.244115 -0.765088 3.979054
H  0.381564 -1.935853 2.665194
H  -2.254661 -0.796078 4.923952
H  -3.569045 -0.85461 3.762239
H  -2.566838 0.583595 3.889026
H  -1.08856 2.684931 -3.132795
H  -0.39825 1.063089 -3.191059
H  1.590187 0.605029 -1.957076
H  -0.728668 4.064939 -0.967634
H  0.976832 4.729489 0.687708
H  2.966221 3.309636 1.068988
H  5.412518 -0.355325 -1.058818
H  1.521235 -0.394207 0.752993
H  5.471443 -2.821995 -0.969669
H  1.577965 -2.845684 0.806213
H  3.545406 -4.081488 -0.048087
elementType: O C H
totalener: -1117.86533402 hartree
nucrepener: 2322.54299766 hartree
electener: -3440.40833167 hartree
oneelecener: -6135.33433398 hartree
twoeener: 2694.92600231 hartree
cpcmener: -0.02430217 hartree
kineticenergy: 1112.80437546 hartree
xcener: -110.227513902131 hartree
chargesum: 0.0000000
charge: -0.290989 -0.474728 -0.331252 0.101592 0.041338 -0.103483 -0.262113 -0.281770 -0.306033 0.407313 -0.011267 -0.217612 -0.296136 0.088302 -0.000929 -0.174452 -0.240331 0.265759 -0.114760 -0.244979 0.282673 -0.253188 -0.180470 -0.120119 -0.129172 -0.200667 0.111952 0.093906 0.094202 0.093449 0.086289 0.094670 0.095013 0.100884 0.113989 0.100732 0.101825 0.067853 0.095378 0.099392 0.108143 0.126757 0.112229 0.139788 0.142707 0.157593 0.145954 0.144383 0.148354 0.157069 0.157647 0.157313
qa: -0.2910 -0.4747 -0.3313 0.1016 0.0413 -0.1035 -0.2621 -0.2818 -0.3060 0.4073 -0.0113 -0.2176 -0.2961 0.0883 -0.0009 -0.1745 -0.2403 0.2658 -0.1148 -0.2450 0.2827 -0.2532 -0.1805 -0.1201 -0.1292 -0.2007 0.1120 0.0939 0.0942 0.0934 0.0863 0.0947 0.0950 0.1009 0.1140 0.1007 0.1018 0.0679 0.0954 0.0994 0.1081 0.1268 0.1122 0.1398 0.1427 0.1576 0.1460 0.1444 0.1484 0.1571 0.1576 0.1573
va: 2.1222 2.0183 2.0819 3.7186 3.7483 3.8655 3.9077 3.9035 3.8960 4.1056 3.6899 3.9230 3.9461 3.8144 3.6129 3.8951 3.9776 3.7368 3.8847 4.0243 3.7620 4.0031 3.9016 3.8893 3.8659 3.9422 1.0005 1.0294 1.0020 1.0023 1.0051 1.0010 1.0150 0.9994 1.0029 0.9976 0.9937 1.0138 1.0036 0.9979 0.9930 0.9924 1.0113 1.0180 1.0055 0.9887 1.0061 1.0089 0.9950 0.9885 0.9895 0.9912
dispcorr: -0.026519770 hartree
energy: -1117.891853785030
dipole: -20.98072 19.73742 -1.24329 -12.83200 13.17970 0.34770 13.32880 -13.01048 0.31833
magnitude: 1.32966 au
magnitude: 3.37973 debye
