program: Orca
programVersion: 5.0.2
elementType: O O O C C C C C C C C C C C C C C C C C C C C C C C H H H H H H H H H H H H H H H H H H H H H H H H H H
charge: 0
multiplicity: 1
keywords: wb97x-d3
keywords: def2-TZVPP
keywords: def2/J RIJCOSX
keywords: DEFGRID2
keywords: scfconv7
keywords: smallprint printgap noloewdin
keywords: NOSOSCF
formula: C23H26O3
InChI: InChI=1/C23H26O3/c1-16(2)13-20-21(23(20,3)4)22(24)25-15-17-9-8-12-19(14-17)26-18-10-6-5-7-11-18/h5-14,20-21H,15H2,1-4H3
52 atoms
O  -1.1368 0.807338 -0.409403
O  -2.766109 -0.366139 -1.382428
O  3.912645 1.639521 0.43126
C  -4.278864 0.368296 1.287852
C  -3.799385 -1.041214 1.392864
C  -2.82332 0.060642 0.977675
C  -4.50557 1.115569 2.580834
C  -5.228831 0.793493 0.195777
C  -4.251376 -2.113913 0.478631
C  -2.280227 0.121182 -0.388849
C  -3.87215 -3.393825 0.544389
C  -4.452928 -4.418625 -0.382653
C  -2.860561 -3.92535 1.513354
C  -0.468944 0.949299 -1.669434
C  0.754002 1.781154 -1.426282
C  1.781914 1.280236 -0.632455
C  0.860389 3.056421 -1.968104
C  2.905765 2.05697 -0.393379
C  1.990854 3.824149 -1.723103
C  3.019913 3.329041 -0.939376
C  4.402121 0.366293 0.341324
C  4.569785 -0.284798 -0.875134
C  4.793101 -0.239623 1.52776
C  5.131602 -1.553827 -0.891308
C  5.362561 -1.504117 1.494244
C  5.530743 -2.169335 0.287619
H  -3.607787 -1.373305 2.4084
H  -2.12003 0.371783 1.741605
H  -4.367762 2.190043 2.443583
H  -3.821908 0.789751 3.365951
H  -5.523869 0.95549 2.941698
H  -5.128792 1.863817 0.004784
H  -6.25861 0.614129 0.511495
H  -5.08354 0.280111 -0.750802
H  -4.984554 -1.846382 -0.274415
H  -3.673698 -4.887152 -0.989995
H  -5.193605 -3.991029 -1.058577
H  -4.934352 -5.226229 0.175983
H  -2.367403 -3.151166 2.098947
H  -2.082269 -4.482026 0.984238
H  -3.320625 -4.631415 2.210723
H  -1.124815 1.433099 -2.396052
H  -0.201525 -0.036028 -2.059125
H  1.699169 0.289149 -0.200511
H  0.058905 3.451734 -2.5798
H  2.073251 4.816206 -2.147713
H  3.90443 3.92289 -0.745908
H  4.276392 0.187801 -1.804366
H  4.657531 0.28034 2.468034
H  5.263631 -2.059747 -1.839197
H  5.670415 -1.971832 2.420673
H  5.971659 -3.157169 0.265039
elementType: O C H
totalener: -1117.86777785 hartree
nucrepener: 2174.20404562 hartree
electener: -3292.07182348 hartree
oneelecener: -5838.07908805 hartree
twoeener: 2546.00726457 hartree
cpcmener: -0.02641542 hartree
kineticenergy: 1112.80033281 hartree
xcener: -110.224185534814 hartree
chargesum: 0.0000000
charge: -0.283225 -0.473298 -0.330651 0.114630 -0.030131 -0.046925 -0.257112 -0.294667 -0.253338 0.377334 -0.026546 -0.231328 -0.266045 0.086613 -0.024346 -0.183847 -0.184701 0.237435 -0.129572 -0.228674 0.274407 -0.182845 -0.245916 -0.149382 -0.122781 -0.187261 0.110697 0.092770 0.095096 0.086339 0.094181 0.100798 0.103237 0.092361 0.117747 0.093969 0.088245 0.092628 0.088400 0.094700 0.099403 0.104889 0.119683 0.143227 0.144007 0.157291 0.146999 0.154932 0.146156 0.159222 0.157354 0.157842
qa: -0.2832 -0.4733 -0.3307 0.1146 -0.0301 -0.0469 -0.2571 -0.2947 -0.2533 0.3773 -0.0265 -0.2313 -0.2660 0.0866 -0.0243 -0.1838 -0.1847 0.2374 -0.1296 -0.2287 0.2744 -0.1828 -0.2459 -0.1494 -0.1228 -0.1873 0.1107 0.0928 0.0951 0.0863 0.0942 0.1008 0.1032 0.0924 0.1177 0.0940 0.0882 0.0926 0.0884 0.0947 0.0994 0.1049 0.1197 0.1432 0.1440 0.1573 0.1470 0.1549 0.1462 0.1592 0.1574 0.1578
va: 2.1290 2.0191 2.0695 3.7941 3.7785 3.8563 3.8932 3.8996 3.8613 4.1091 3.7275 3.9303 3.9479 3.8101 3.7714 3.9136 3.9226 3.7525 3.9092 4.0043 3.7029 3.8982 4.0014 3.8984 3.8891 3.9043 1.0029 1.0274 1.0025 1.0051 1.0023 0.9999 0.9985 1.0185 1.0056 0.9965 1.0084 0.9952 1.0071 0.9977 0.9963 1.0059 0.9956 1.0116 1.0024 0.9899 1.0056 0.9981 1.0082 0.9904 0.9892 0.9905
dispcorr: -0.022388213 hartree
energy: -1117.890166067588
dipole: -28.14817 28.36344 0.21527 -14.33609 14.32477 -0.01132 6.62615 -6.15308 0.47306
magnitude: 0.51986 au
magnitude: 1.32138 debye
