program: Orca
programVersion: 5.0.2
elementType: O O O C C C C C C C C C C C C C C C C C C C C C C C H H H H H H H H H H H H H H H H H H H H H H H H H H
charge: 0
multiplicity: 1
keywords: wb97x-d3
keywords: def2-TZVPP
keywords: def2/J RIJCOSX
keywords: DEFGRID2
keywords: scfconv7
keywords: smallprint printgap noloewdin
keywords: NOSOSCF
formula: C23H26O3
InChI: InChI=1/C23H26O3/c1-16(2)13-20-21(23(20,3)4)22(24)25-15-17-9-8-12-19(14-17)26-18-10-6-5-7-11-18/h5-14,20-21H,15H2,1-4H3
52 atoms
O  -2.272658 2.171997 -0.547842
O  -1.961129 0.284771 -1.697025
O  2.440652 1.056276 0.818474
C  -4.074895 -0.989607 0.189619
C  -2.859821 -0.982764 1.06383
C  -3.283462 0.292305 0.31657
C  -5.412202 -0.96686 0.894143
C  -4.114468 -1.78148 -1.094817
C  -1.61898 -1.712151 0.744873
C  -2.450917 0.860825 -0.756326
C  -0.736067 -2.18301 1.635002
C  0.471339 -2.948338 1.181315
C  -0.828359 -2.0188 3.121294
C  -1.48058 2.89489 -1.477963
C  -0.00378 2.622309 -1.371698
C  0.55598 1.927771 -0.306122
C  0.827626 3.116811 -2.372083
C  1.92767 1.732143 -0.259223
C  2.19967 2.931756 -2.301531
C  2.764433 2.236864 -1.242724
C  3.079707 -0.132966 0.62263
C  3.856842 -0.59332 1.680865
C  2.957759 -0.886647 -0.538879
C  4.510757 -1.810248 1.572781
C  3.626522 -2.100344 -0.633244
C  4.40362 -2.570427 0.414642
H  -3.077049 -0.90288 2.12264
H  -3.725676 1.047309 0.956194
H  -5.73371 -1.980959 1.140467
H  -6.180476 -0.519848 0.25953
H  -5.377268 -0.396908 1.823887
H  -4.787543 -1.311416 -1.814431
H  -4.505816 -2.779606 -0.887966
H  -3.151118 -1.904875 -1.57935
H  -1.408733 -1.898863 -0.301954
H  1.390126 -2.498339 1.566855
H  0.547254 -2.997941 0.095476
H  0.448476 -3.972831 1.56376
H  -0.766555 -2.990042 3.61909
H  -1.738521 -1.531498 3.464441
H  0.017683 -1.432248 3.490265
H  -1.676866 3.94374 -1.25058
H  -1.824336 2.717149 -2.50002
H  -0.051024 1.529658 0.49803
H  0.400553 3.6526 -3.211712
H  2.837088 3.327978 -3.081347
H  3.835371 2.086106 -1.187961
H  3.944224 0.001328 2.581875
H  2.344281 -0.551187 -1.364796
H  5.113339 -2.162413 2.400381
H  3.527639 -2.683983 -1.539638
H  4.919392 -3.517922 0.331697
elementType: O C H
totalener: -1117.86716949 hartree
nucrepener: 2329.72009190 hartree
electener: -3447.58726139 hartree
oneelecener: -6149.70094911 hartree
twoeener: 2702.11368772 hartree
cpcmener: -0.02552768 hartree
kineticenergy: 1112.79610360 hartree
xcener: -110.230137341775 hartree
chargesum: -0.0000000
charge: -0.297222 -0.455730 -0.328550 0.113576 0.031480 -0.082849 -0.261814 -0.286596 -0.293189 0.370010 -0.049503 -0.222912 -0.256521 0.081636 0.025334 -0.219596 -0.206636 0.225690 -0.135818 -0.179447 0.307986 -0.251257 -0.183237 -0.121128 -0.185371 -0.181407 0.114269 0.094826 0.094952 0.093904 0.085631 0.100836 0.095102 0.097272 0.120638 0.069588 0.092778 0.108216 0.096042 0.088818 0.098365 0.128754 0.117507 0.127329 0.141529 0.158480 0.155825 0.142500 0.149846 0.156381 0.157389 0.156294
qa: -0.2972 -0.4557 -0.3285 0.1136 0.0315 -0.0828 -0.2618 -0.2866 -0.2932 0.3700 -0.0495 -0.2229 -0.2565 0.0816 0.0253 -0.2196 -0.2066 0.2257 -0.1358 -0.1794 0.3080 -0.2513 -0.1832 -0.1211 -0.1854 -0.1814 0.1143 0.0948 0.0950 0.0939 0.0856 0.1008 0.0951 0.0973 0.1206 0.0696 0.0928 0.1082 0.0960 0.0888 0.0984 0.1288 0.1175 0.1273 0.1415 0.1585 0.1558 0.1425 0.1498 0.1564 0.1574 0.1563
va: 2.1111 2.0354 2.0592 3.7404 3.7411 3.8197 3.9012 3.8971 3.8487 4.1163 3.7749 3.9275 3.9416 3.8172 3.6457 4.0369 3.9620 3.7765 3.8868 3.9494 3.6367 3.9749 3.8211 3.8896 3.8999 3.8857 1.0011 1.0307 1.0020 1.0024 1.0054 0.9991 1.0007 1.0158 1.0186 1.0008 1.0042 0.9991 0.9972 1.0138 0.9968 0.9908 1.0101 1.0256 1.0009 0.9899 0.9965 1.0107 1.0048 0.9895 0.9924 0.9909
dispcorr: -0.027381161 hartree
energy: -1117.894550653213
dipole: -14.38281 13.96194 -0.42086 -16.68915 16.96621 0.27706 6.90751 -6.58294 0.32457
magnitude: 0.59936 au
magnitude: 1.52346 debye
