program: Orca
programVersion: 5.0.2
elementType: O O O C C C C C C C C C C C C C C C C C C C C C C C H H H H H H H H H H H H H H H H H H H H H H H H H H
charge: 0
multiplicity: 1
keywords: wb97x-d3
keywords: def2-TZVPP
keywords: def2/J RIJCOSX
keywords: DEFGRID2
keywords: scfconv7
keywords: smallprint printgap noloewdin
keywords: NOSOSCF
formula: C23H26O3
InChI: InChI=1/C23H26O3/c1-16(2)13-20-21(23(20,3)4)22(24)25-15-17-9-8-12-19(14-17)26-18-10-6-5-7-11-18/h5-14,20-21H,15H2,1-4H3
52 atoms
O  -0.692095 0.686689 0.56795
O  -2.609512 0.775102 1.702078
O  4.286413 0.755116 -0.176272
C  -2.848382 -2.26889 1.071696
C  -3.414678 -1.602025 -0.133064
C  -2.048067 -1.168369 0.399447
C  -2.273375 -3.655234 0.894463
C  -3.478452 -2.066406 2.427438
C  -4.609611 -0.722612 -0.071944
C  -1.855043 0.172403 0.976261
C  -4.815673 0.344157 -0.847946
C  -6.075117 1.14909 -0.7512
C  -3.820262 0.836821 -1.852581
C  -0.324816 1.974061 1.056609
C  1.039352 2.308866 0.527008
C  2.018191 1.328235 0.40391
C  1.342869 3.627822 0.207794
C  3.280183 1.672058 -0.061291
C  2.616865 3.962668 -0.22688
C  3.59039 2.987891 -0.375896
C  4.019257 -0.520668 -0.591983
C  3.141005 -0.793061 -1.634705
C  4.714024 -1.546411 0.033228
C  2.95608 -2.107482 -2.037959
C  4.528181 -2.855079 -0.389414
C  3.644384 -3.143239 -1.419932
H  -3.320979 -2.166606 -1.057831
H  -1.203483 -1.509173 -0.188275
H  -1.503128 -3.858897 1.641095
H  -1.823615 -3.788679 -0.090629
H  -3.052925 -4.411699 1.007034
H  -4.223738 -2.845876 2.599564
H  -3.975981 -1.108207 2.546429
H  -2.729529 -2.151958 3.217187
H  -5.382929 -1.000336 0.638874
H  -6.61701 1.147955 -1.700822
H  -5.854426 2.195363 -0.523255
H  -6.74749 0.772157 0.01967
H  -2.953961 0.186311 -1.958097
H  -3.459611 1.832947 -1.580353
H  -4.28202 0.938245 -2.838326
H  -0.314672 1.968858 2.150573
H  -1.049931 2.72671 0.737434
H  1.800039 0.301196 0.668982
H  0.583131 4.394607 0.297832
H  2.850748 4.990914 -0.470414
H  4.581017 3.241627 -0.731702
H  2.605492 0.00535 -2.132858
H  5.39994 -1.319132 0.839779
H  2.269166 -2.319162 -2.847296
H  5.075743 -3.652323 0.096633
H  3.495842 -4.165359 -1.742458
elementType: O C H
totalener: -1117.86694313 hartree
nucrepener: 2239.59925644 hartree
electener: -3357.46619958 hartree
oneelecener: -5968.71637427 hartree
twoeener: 2611.25017469 hartree
cpcmener: -0.02543607 hartree
kineticenergy: 1112.80263451 hartree
xcener: -110.227240519870 hartree
chargesum: -0.0000000
charge: -0.286914 -0.466756 -0.329323 0.129120 -0.021676 -0.068773 -0.265289 -0.298445 -0.276303 0.368348 -0.015033 -0.223304 -0.265486 0.093195 0.029113 -0.202920 -0.235096 0.258678 -0.114975 -0.248899 0.278226 -0.182726 -0.247251 -0.150732 -0.121679 -0.185211 0.112070 0.094559 0.095743 0.085610 0.093637 0.097627 0.097132 0.100484 0.119729 0.095111 0.093442 0.088755 0.093962 0.098396 0.106980 0.114759 0.107770 0.137221 0.140863 0.156077 0.145146 0.155525 0.145383 0.158799 0.157165 0.158168
qa: -0.2869 -0.4668 -0.3293 0.1291 -0.0217 -0.0688 -0.2653 -0.2984 -0.2763 0.3683 -0.0150 -0.2233 -0.2655 0.0932 0.0291 -0.2029 -0.2351 0.2587 -0.1150 -0.2489 0.2782 -0.1827 -0.2473 -0.1507 -0.1217 -0.1852 0.1121 0.0946 0.0957 0.0856 0.0936 0.0976 0.0971 0.1005 0.1197 0.0951 0.0934 0.0888 0.0940 0.0984 0.1070 0.1148 0.1078 0.1372 0.1409 0.1561 0.1451 0.1555 0.1454 0.1588 0.1572 0.1582
va: 2.1122 2.0243 2.0740 3.7373 3.8385 3.8192 3.9025 3.8942 3.8631 4.0894 3.7099 3.9264 3.9425 3.8202 3.7341 3.9117 3.9729 3.7559 3.9014 4.0123 3.7002 3.9035 4.0060 3.8913 3.8857 3.9023 1.0059 1.0247 1.0022 1.0049 1.0023 0.9985 1.0151 1.0006 1.0019 0.9965 0.9969 1.0072 1.0063 0.9985 0.9993 0.9953 1.0009 1.0236 1.0043 0.9897 1.0070 0.9974 1.0082 0.9906 0.9893 0.9903
dispcorr: -0.024158477 hartree
energy: -1117.891101610516
dipole: -28.08861 28.11050 0.02189 -9.02137 8.50648 -0.51489 -1.51346 0.71931 -0.79414
magnitude: 0.94671 au
magnitude: 2.40633 debye
