program: Gaussian 09
title: 000067725
version: EM64L-G09RevD.01
frameworkgroup: C1[X(C6F12O2S)]
method: RPBEPBE
basis: SDD
operation: Freq
keyword: #p
keyword: freq=noraman
keyword: PBEPBE/SDD
title: #p freq=noraman PBEPBE/SDD
converged: NO YES NO NO
title: Mulliken charges:
elementType: S F F F F F F F F F F F F O O C C C C C C
charge: 1.165861 -0.060247 -0.101667 -0.114723 -0.108104 -0.106101 -0.109012 -0.111341 -0.111979 -0.108816 -0.116082 -0.111158 -0.289058 -0.401388 -0.402823 -0.238184 0.291596 0.314693 0.240368 0.238030 0.240134
chargesum: 0.00000
title: Mulliken charges with hydrogens summed into heavy atoms:
polarizability: 1.31333987e+02 4.05922356e+00 9.47683570e+01 1.07225151e+00 2.34845076e+00 9.73650582e+01
1716.lowfreq: -7.6216 -4.2241 -0.0010 0.0012 0.0018 5.0402 22.8995 60.5096 75.6078
frequency: 22.7241 60.5059 75.6075 90.7288 102.9577 133.6516 144.4725 146.5623 161.8658 169.1813 184.3023 219.6018 222.4943 228.5799 229.8157 244.5091 260.8423 273.8737 275.7608 283.9368 285.7865 292.4545 305.0079 306.8910 341.3487 347.1822 349.5441 399.2245 408.5943 446.0800 508.2095 526.1150 551.2107 558.8745 564.4985 567.7813 615.3411 679.4580 752.8969 877.1316 880.6432 916.7633 971.4190 1005.5084 1012.8743 1028.2069 1031.6765 1033.9789 1073.6199 1081.3891 1092.1080 1122.7797 1142.8567 1147.7857 1157.7195 1169.4754 1186.6654
redmass: 17.2061 18.4069 18.5958 18.0273 18.2921 18.5328 18.3299 18.2487 18.0676 18.0219 17.4461 18.8217 18.8260 18.2871 18.7418 18.7912 18.7401 18.3651 18.4917 18.8573 18.5401 18.1986 18.2401 18.3060 17.1044 17.4196 17.7787 20.4418 17.4709 17.5086 17.1093 16.9966 16.5980 19.2895 17.4219 18.9489 17.9768 14.3763 12.6839 15.0693 16.5188 13.5353 13.7094 13.1054 19.3417 13.7267 13.2314 13.2580 13.1991 13.1273 12.2456 12.6841 12.7188 12.4631 12.5629 12.4831 12.1263
irintensity: 0.0404 0.2111 0.1327 0.4316 0.4461 0.9826 1.5088 0.7257 0.7500 3.1905 0.3075 0.4632 0.2129 1.3240 0.3822 0.2966 0.7653 7.5516 11.1975 1.7314 1.2394 0.2521 2.5315 2.8823 0.0601 1.0673 0.4523 108.4916 14.8776 1.0024 0.8314 4.2621 13.2372 44.4791 9.8003 64.1522 1.1847 24.6623 0.5172 173.8462 27.9624 177.1897 1.5794 5.0512 28.7906 1.6197 11.4044 15.5655 237.3950 116.9935 25.7204 92.4236 85.2660 127.3101 26.4904 51.4856 2.3491
temp: 298.150 k
press: 1.00000 atm
elementType: 16 9 9 9 9 9 9 9 9 9 9 9 9 8 8 6 6 6 6 6 6
symmnumber: 1
zpe: 187042.6 jmol-1
zpe.correction: 0.071241 hartree
zpe.thermalcorrener: 0.092008 hartree
zpe.thermalcorrenthalpy: 0.092953 hartree
zpe.thermalcorrgfe: 0.022465 hartree
zpe.sumelectzpe: -1973.389041 hartree
zpe.sumelectthermal: -1973.368273 hartree
zpe.sumelectthermalent: -1973.367329 hartree
zpe.sumelectthermalfe: -1973.437816 hartree
dipole: 1.6068 -0.3878 0.3999
dipole: 1.7006
quadrupole: -132.8725 -128.7099 -130.0198
quadrupole: 0.6491 -0.3276 -0.4449
quadrupole: -2.3384 1.8242 0.5143 0.6491 -0.3276 -0.4449
hfenergy: -1973.4602813 hartree
pointgroup: C01 [X(C6F12O2S1)]
dipole: 0.6331781 -0.1527688 0.1530294 debye
dipolederiv: 1.6649851 0.0387106 -0.0065727 -0.0309957 1.4270668 -0.066825 0.0836401 -0.0336002 1.167005 -0.1549813 0.0025408 -0.0402084 0.0412375 -0.1970306 0.0402346 -0.3460103 0.0038159 -0.5664763 -0.2483181 0.0256066 -0.0285212 0.009664 -0.2304062 -0.0215823 0.0636405 0.0698997 -0.5097976 -0.3127996 -0.1418358 0.0808029 -0.0611148 -0.5698809 0.148587 0.0279394 0.1018808 -0.2475176 -0.3047934 0.117665 0.1133588 0.0728222 -0.4899037 -0.193565 0.0457884 -0.1607319 -0.3167629 -0.2494328 -0.0189014 -0.0534324 -0.0224471 -0.2387623 0.0769794 0.0547618 0.0140328 -0.5277109 -0.5053441 0.1790104 0.1117606 0.2416456 -0.5259088 -0.1838554 0.1215764 -0.1405225 -0.3257579 -0.3014893 0.0199924 -0.0677922 0.0182714 -0.273182 0.1047616 -0.0530129 0.0375379 -0.5735741 -0.3048665 -0.0109984 -0.0708045 -0.0066316 -0.2590385 -0.0483687 -0.0632968 0.0176831 -0.593703 -0.4820362 -0.2013471 0.0644631 -0.2522568 -0.6172096 0.1419218 0.068844 0.1002332 -0.2733943 -0.7526493 -0.0049672 -0.1632773 -0.0066962 -0.2628963 -0.0045485 -0.0965166 -0.0022262 -0.2741466 -0.283547 -0.007926 0.0653019 0.0006968 -0.2577039 0.0341504 -0.0107326 0.0321753 -0.5896446 -0.4069956 0.0688119 -0.0384566 0.2266392 -0.750746 0.1501773 -0.0758762 0.1297114 -0.3171217 -0.5352681 -0.0370524 -0.0566643 -0.0970923 -0.372321 -0.0580817 -0.1026307 -0.0962319 -0.4344454 -0.5902594 -0.0384375 0.0195205 -0.0690337 -0.3273379 -0.0166583 0.0970263 0.0179626 -0.4092795 0.1719115 -0.0118945 0.1331715 -0.0741396 0.0796306 -0.0556625 0.4843716 -0.0146581 0.5261186 0.3854934 0.19583 -0.0496819 -0.2933611 0.8558489 -0.1910645 -0.2769254 -0.0638069 0.7562792 0.3635187 -0.2137914 -0.0963395 0.311705 0.8477128 0.1937043 -0.2098891 0.0237897 0.8443084 0.8903634 -0.2344458 -0.0629352 -0.1615749 0.8048311 0.1286712 0.0801405 0.0304674 0.9162801 0.8793789 0.2588023 -0.0019071 0.1335491 0.8620217 -0.1482472 0.117088 -0.0288816 0.8836447 1.0771298 0.0146273 0.1482139 0.0191129 0.4952159 -0.0307286 -0.0099262 -0.0385304 0.8656966 unknown
polarizability: 131.0861401|4.712669|94.5426624|1.9662381|2.1752291|97.8385995 unknown
InChI: InChI=1S/C6F12O2S/c7-1(8)2(9,10)4(13,14)6(17,21(18,19)20)5(15,16)3(1,11)12
charge 0 multiplicity 1
21 atoms
S  -2.930809 -0.22517 -0.123255
F  -0.930066 -0.217803 1.784542
F  -0.296782 -1.267881 -1.638135
F  -0.69346 -2.480709 0.262051
F  -0.839216 2.315579 0.758905
F  -0.429219 1.533165 -1.359829
F  2.041616 -2.309356 -0.664418
F  1.6050 -1.551913 1.444335
F  1.50376 1.343694 1.712105
F  1.858174 2.507425 -0.219162
F  3.410236 0.095019 0.21624
F  2.153512 0.223336 -1.684391
F  -3.164222 1.531063 -0.593942
O  -3.214025 -1.093757 -1.431142
O  -3.694814 -0.44935 1.260152
C  -0.856989 -0.080016 0.392778
C  -0.125627 -1.292139 -0.234799
C  -0.235951 1.289143 0.018636
C  1.421759 -1.287781 0.06773
C  1.320652 1.326397 0.309885
C  2.096672 0.091054 -0.278286
