program: Orca
programVersion: 5.0.2
elementType: O O O C C C C C C C C C C C C C C C C C C C C C C C H H H H H H H H H H H H H H H H H H H H H H H H H H
charge: 0
multiplicity: 1
keywords: wb97x-d3
keywords: def2-TZVPP
keywords: def2/J RIJCOSX
keywords: DEFGRID2
keywords: scfconv7
keywords: smallprint printgap noloewdin
keywords: NOSOSCF
formula: C23H26O3
InChI: InChI=1/C23H26O3/c1-16(2)13-20-21(23(20,3)4)22(24)25-15-17-9-8-12-19(14-17)26-18-10-6-5-7-11-18/h5-14,20-21H,15H2,1-4H3
52 atoms
O  -1.315131 1.410432 -1.263704
O  -1.490948 1.391758 0.966228
O  3.657095 0.717161 -0.450323
C  -1.485695 -1.727544 0.483168
C  -2.925352 -1.34606 0.645394
C  -2.042272 -0.566016 -0.321877
C  -1.184961 -2.973591 -0.31505
C  -0.501862 -1.498351 1.603306
C  -3.467358 -0.76819 1.889775
C  -1.606371 0.82575 -0.087308
C  -4.569514 -1.173161 2.527227
C  -4.999664 -0.497567 3.796388
C  -5.465131 -2.294722 2.09326
C  -0.800355 2.728074 -1.239957
C  0.70273 2.781063 -1.135145
C  1.467138 1.655898 -0.862737
C  1.328085 4.010574 -1.313147
C  2.849557 1.76716 -0.767819
C  2.705587 4.10957 -1.216159
C  3.476739 2.99105 -0.948091
C  3.263895 -0.5690 -0.678345
C  2.829561 -0.992728 -1.928942
C  3.375809 -1.470808 0.369721
C  2.5113 -2.327831 -2.121285
C  3.064401 -2.806369 0.161269
C  2.628767 -3.240186 -1.081481
H  -3.614063 -1.995162 0.115195
H  -2.210935 -0.782579 -1.370285
H  -0.19429 -2.912479 -0.769002
H  -1.911341 -3.134492 -1.113245
H  -1.202665 -3.853959 0.330639
H  0.514897 -1.446332 1.208754
H  -0.542218 -2.33952 2.297656
H  -0.684905 -0.59201 2.17252
H  -2.917127 0.056538 2.322438
H  -6.01119 -0.093193 3.705222
H  -4.335764 0.321642 4.069227
H  -5.021333 -1.203887 4.630704
H  -6.490359 -1.94056 1.95771
H  -5.505894 -3.070255 2.862962
H  -5.155957 -2.77404 1.167003
H  -1.246906 3.305146 -0.426548
H  -1.115626 3.180579 -2.181743
H  0.999302 0.691385 -0.722229
H  0.737099 4.893061 -1.527822
H  3.188401 5.067425 -1.357867
H  4.55375 3.058711 -0.87286
H  2.746668 -0.287358 -2.745881
H  3.714045 -1.123476 1.337126
H  2.17543 -2.657584 -3.095656
H  3.157311 -3.508173 0.97956
H  2.384612 -4.281876 -1.240746
totalener: -1117.84468954 hartree
nucrepener: 2307.90304367 hartree
electener: -3425.74773321 hartree
oneelecener: -6104.50189902 hartree
twoeener: 2678.75416581 hartree
kineticenergy: 1112.83688087 hartree
xcener: -110.235353981155 hartree
chargesum: 0.0000000
charge: -0.276198 -0.379956 -0.295406 0.119478 0.034245 -0.088066 -0.241372 -0.246088 -0.232921 0.308670 -0.048337 -0.206394 -0.242324 0.052777 0.039251 -0.177675 -0.221210 0.296152 -0.072084 -0.231387 0.256877 -0.176185 -0.202173 -0.093195 -0.090476 -0.177412 0.087445 0.081327 0.078803 0.073420 0.088474 0.057118 0.091250 0.106895 0.111947 0.080820 0.081729 0.081248 0.086292 0.085621 0.076315 0.113500 0.112554 0.097038 0.107342 0.122600 0.122846 0.133191 0.126331 0.129115 0.126438 0.131755
qa: -0.2762 -0.3800 -0.2954 0.1195 0.0342 -0.0881 -0.2414 -0.2461 -0.2329 0.3087 -0.0483 -0.2064 -0.2423 0.0528 0.0393 -0.1777 -0.2212 0.2962 -0.0721 -0.2314 0.2569 -0.1762 -0.2022 -0.0932 -0.0905 -0.1774 0.0874 0.0813 0.0788 0.0734 0.0885 0.0571 0.0912 0.1069 0.1119 0.0808 0.0817 0.0812 0.0863 0.0856 0.0763 0.1135 0.1126 0.0970 0.1073 0.1226 0.1228 0.1332 0.1263 0.1291 0.1264 0.1318
va: 2.1260 2.0983 2.1204 3.6961 3.7838 3.8888 3.9042 3.9093 3.9082 4.1902 3.8043 3.9394 3.9455 3.8848 3.7283 3.9545 4.0276 3.7678 3.9454 4.0377 3.7863 3.9574 3.9832 3.8687 3.8623 3.9118 1.0093 1.0316 1.0153 1.0111 1.0048 1.0185 1.0047 1.0225 1.0311 0.9984 1.0126 0.9976 0.9991 0.9991 1.0163 1.0104 0.9875 1.0179 1.0094 0.9994 1.0154 1.0026 1.0144 0.9987 0.9993 0.9995
dispcorr: -0.026994302 hartree
energy: -1117.871683845750
dipole: -22.72401 22.44720 -0.27681 -16.16158 15.59436 -0.56722 11.38105 -11.96587 -0.58482
magnitude: 0.86045 au
magnitude: 2.18710 debye
