program: Orca
programVersion: 5.0.2
elementType: O O O C C C C C C C C C C C C C C C C C C C C C C C H H H H H H H H H H H H H H H H H H H H H H H H H H
charge: 0
multiplicity: 1
keywords: wb97x-d3
keywords: def2-TZVPP
keywords: def2/J RIJCOSX
keywords: DEFGRID2
keywords: scfconv7
keywords: smallprint printgap noloewdin
keywords: NOSOSCF
formula: C23H26O3
InChI: InChI=1/C23H26O3/c1-16(2)13-20-21(23(20,3)4)22(24)25-15-17-9-8-12-19(14-17)26-18-10-6-5-7-11-18/h5-14,20-21H,15H2,1-4H3
52 atoms
O  -1.041901 0.877615 -1.497857
O  -1.772821 1.608971 0.481279
O  4.120136 0.694931 -0.792964
C  -1.84182 -1.431986 1.197026
C  -3.221315 -1.154167 0.682002
C  -2.005754 -0.708601 -0.125815
C  -1.342381 -2.854211 1.090979
C  -1.32081 -0.720781 2.421106
C  -4.15208 -0.205709 1.320868
C  -1.622513 0.707991 -0.301635
C  -5.44592 -0.426961 1.570608
C  -6.284803 0.630768 2.225677
C  -6.194188 -1.685003 1.246177
C  -0.459248 2.153007 -1.754596
C  0.839451 2.315776 -1.016086
C  1.869424 1.412643 -1.253344
C  1.021893 3.341993 -0.100023
C  3.069616 1.536111 -0.569663
C  2.234648 3.473289 0.559638
C  3.260366 2.570011 0.336803
C  3.902568 -0.643007 -0.943154
C  4.699442 -1.314068 -1.860132
C  2.968494 -1.33846 -0.183384
C  4.563975 -2.684864 -2.013348
C  2.838029 -2.707615 -0.354684
C  3.631319 -3.388643 -1.266275
H  -3.70188 -2.013864 0.228201
H  -1.801433 -1.310716 -1.003308
H  -1.644065 -3.434187 1.965135
H  -0.251954 -2.881101 1.034361
H  -1.730528 -3.361561 0.20678
H  -1.691567 0.292527 2.534905
H  -0.230396 -0.669616 2.396937
H  -1.605647 -1.282311 3.312456
H  -3.746487 0.755402 1.609623
H  -7.125053 0.917318 1.587671
H  -5.711744 1.530095 2.446658
H  -6.716082 0.267638 3.162267
H  -5.579903 -2.465703 0.80345
H  -7.014855 -1.477493 0.554811
H  -6.649268 -2.101883 2.14795
H  -1.152404 2.959242 -1.507576
H  -0.293586 2.167719 -2.832264
H  1.731733 0.609097 -1.967539
H  0.212415 4.029432 0.106597
H  2.376824 4.274547 1.272521
H  4.204575 2.657426 0.857785
H  5.422642 -0.758985 -2.442996
H  2.348304 -0.819803 0.536574
H  5.189287 -3.203214 -2.728253
H  2.110658 -3.246943 0.238329
H  3.524533 -4.457497 -1.391501
totalener: -1117.84483495 hartree
nucrepener: 2264.54098840 hartree
electener: -3382.38582334 hartree
oneelecener: -6017.77389953 hartree
twoeener: 2635.38807619 hartree
kineticenergy: 1112.85364893 hartree
xcener: -110.232945065411 hartree
chargesum: -0.0000000
charge: -0.271735 -0.396505 -0.300816 0.087492 0.023854 -0.075834 -0.235722 -0.250165 -0.222136 0.352080 -0.050995 -0.205921 -0.242781 0.064745 0.004130 -0.210619 -0.130383 0.233258 -0.089640 -0.209198 0.244236 -0.211680 -0.163240 -0.088778 -0.114928 -0.152976 0.086265 0.081890 0.091514 0.071716 0.073252 0.103846 0.082822 0.087310 0.109806 0.081862 0.081354 0.081317 0.076598 0.087982 0.084758 0.099600 0.111289 0.123578 0.109838 0.124384 0.125649 0.124716 0.130982 0.124580 0.133494 0.123856
qa: -0.2717 -0.3965 -0.3008 0.0875 0.0239 -0.0758 -0.2357 -0.2502 -0.2221 0.3521 -0.0510 -0.2059 -0.2428 0.0647 0.0041 -0.2106 -0.1304 0.2333 -0.0896 -0.2092 0.2442 -0.2117 -0.1632 -0.0888 -0.1149 -0.1530 0.0863 0.0819 0.0915 0.0717 0.0733 0.1038 0.0828 0.0873 0.1098 0.0819 0.0814 0.0813 0.0766 0.0880 0.0848 0.0996 0.1113 0.1236 0.1098 0.1244 0.1256 0.1247 0.1310 0.1246 0.1335 0.1239
va: 2.1229 2.0914 2.1079 3.7362 3.8113 3.8721 3.9143 3.9233 3.9055 4.1677 3.8076 3.9390 3.9456 3.8678 3.7004 3.9454 3.9836 3.8205 3.9401 4.0369 3.8387 4.0348 3.9423 3.9389 3.9373 3.9881 1.0102 1.0306 1.0052 1.0123 1.0086 1.0197 1.0034 1.0022 1.0289 0.9979 1.0127 0.9983 1.0166 0.9984 0.9998 1.0127 0.9911 1.0185 1.0173 0.9995 1.0122 1.0143 1.0027 0.9986 0.9954 1.0020
dispcorr: -0.024923835 hartree
energy: -1117.869758780430
dipole: -27.90675 27.62756 -0.27919 -12.19087 11.58569 -0.60518 12.62588 -12.84665 -0.22077
magnitude: 0.70209 au
magnitude: 1.78457 debye
