program: Orca
programVersion: 5.0.2
elementType: O O O C C C C C C C C C C C C C C C C C C C C C C C H H H H H H H H H H H H H H H H H H H H H H H H H H
charge: 0
multiplicity: 1
keywords: wb97x-d3
keywords: def2-TZVPP
keywords: def2/J RIJCOSX
keywords: DEFGRID2
keywords: scfconv7
keywords: smallprint printgap noloewdin
keywords: NOSOSCF
formula: C23H26O3
InChI: InChI=1/C23H26O3/c1-16(2)13-20-21(23(20,3)4)22(24)25-15-17-9-8-12-19(14-17)26-18-10-6-5-7-11-18/h5-14,20-21H,15H2,1-4H3
52 atoms
O  -1.27573 1.255382 -1.199183
O  -1.540629 1.139002 1.018363
O  3.808059 0.578422 -1.102276
C  -1.834797 -1.92511 0.523089
C  -3.220036 -1.380353 0.458045
C  -2.11522 -0.732433 -0.371653
C  -1.550263 -3.214316 -0.211776
C  -1.017426 -1.772928 1.781368
C  -3.863308 -0.696871 1.607722
C  -1.625469 0.624926 -0.062969
C  -4.775206 0.269708 1.511604
C  -5.400913 0.878442 2.728854
C  -5.230492 0.84367 0.205367
C  -0.684737 2.538696 -1.05495
C  0.725022 2.464552 -0.53567
C  1.607039 1.522565 -1.049766
C  1.167547 3.358401 0.430666
C  2.914284 1.476183 -0.588198
C  2.481611 3.319454 0.868416
C  3.36232 2.37275 0.369168
C  3.526076 -0.753174 -1.047917
C  4.111635 -1.554821 -2.020035
C  2.73498 -1.31977 -0.055298
C  3.906574 -2.92426 -1.995593
C  2.537317 -2.693055 -0.046834
C  3.115456 -3.502055 -1.012722
H  -3.907554 -1.955041 -0.158603
H  -2.140085 -0.951734 -1.432815
H  -0.507037 -3.258058 -0.53059
H  -2.173008 -3.323774 -1.100568
H  -1.742058 -4.074656 0.4324
H  -1.211874 -0.849987 2.3195
H  0.047751 -1.795445 1.543879
H  -1.221716 -2.608913 2.453494
H  -3.579639 -1.039122 2.597892
H  -6.488831 0.776544 2.708189
H  -5.187045 1.948834 2.781114
H  -5.037767 0.420929 3.648087
H  -5.012403 1.913941 0.162731
H  -6.312534 0.742745 0.0896
H  -4.757162 0.37517 -0.655132
H  -1.292514 3.181512 -0.414103
H  -0.696118 2.961946 -2.060612
H  1.28047 0.818065 -1.805567
H  0.47888 4.080289 0.850725
H  2.819624 4.018001 1.622144
H  4.386141 2.32321 0.715158
H  4.72645 -1.098715 -2.784858
H  2.280793 -0.702975 0.709633
H  4.365532 -3.542333 -2.756034
H  1.928255 -3.132545 0.732942
H  2.956239 -4.57156 -0.996407
totalener: -1117.84293976 hartree
nucrepener: 2319.33426005 hartree
electener: -3437.17719980 hartree
oneelecener: -6127.53596869 hartree
twoeener: 2690.35876889 hartree
kineticenergy: 1112.86372187 hartree
xcener: -110.234305596322 hartree
chargesum: -0.0000000
charge: -0.280710 -0.366732 -0.301631 0.151273 -0.057166 -0.081526 -0.246784 -0.281264 -0.186842 0.315801 0.003807 -0.210106 -0.258935 0.075192 0.049746 -0.211805 -0.150526 0.208458 -0.096092 -0.193577 0.235397 -0.211643 -0.126597 -0.088901 -0.165334 -0.148419 0.097917 0.085055 0.090537 0.071666 0.087097 0.114142 0.052957 0.093078 0.082610 0.082381 0.087282 0.077241 0.090165 0.095505 0.084148 0.096396 0.106475 0.126752 0.105329 0.124235 0.125789 0.124312 0.136173 0.124160 0.139090 0.124423
qa: -0.2807 -0.3667 -0.3016 0.1513 -0.0572 -0.0815 -0.2468 -0.2813 -0.1868 0.3158 0.0038 -0.2101 -0.2589 0.0752 0.0497 -0.2118 -0.1505 0.2085 -0.0961 -0.1936 0.2354 -0.2116 -0.1266 -0.0889 -0.1653 -0.1484 0.0979 0.0851 0.0905 0.0717 0.0871 0.1141 0.0530 0.0931 0.0826 0.0824 0.0873 0.0772 0.0902 0.0955 0.0841 0.0964 0.1065 0.1268 0.1053 0.1242 0.1258 0.1243 0.1362 0.1242 0.1391 0.1244
va: 2.1035 2.1142 2.1021 3.6981 3.9148 3.7941 3.9051 3.9116 3.9074 4.1602 3.7481 3.9414 3.9482 3.8721 3.6704 3.9699 4.0100 3.8368 3.9417 4.0455 3.8520 4.0288 3.8692 3.9492 3.9344 3.9710 1.0039 1.0307 1.0086 1.0100 1.0031 1.0211 1.0241 0.9987 1.0115 0.9982 0.9990 1.0113 0.9999 1.0013 1.0082 1.0120 0.9880 1.0213 1.0128 0.9999 1.0108 1.0144 1.0041 0.9980 0.9898 1.0015
dispcorr: -0.027226977 hartree
energy: -1117.870166733073
dipole: -24.38468 23.95327 -0.43141 -9.03688 8.86755 -0.16932 8.57804 -8.86891 -0.29087
magnitude: 0.54716 au
magnitude: 1.39077 debye
