program: Orca
programVersion: 5.0.2
elementType: O O O C C C C C C C C C C C C C C C C C C C C C C C H H H H H H H H H H H H H H H H H H H H H H H H H H
charge: 0
multiplicity: 1
keywords: wb97x-d3
keywords: def2-TZVPP
keywords: def2/J RIJCOSX
keywords: DEFGRID2
keywords: scfconv7
keywords: smallprint printgap noloewdin
keywords: NOSOSCF
formula: C23H26O3
InChI: InChI=1/C23H26O3/c1-16(2)13-20-21(23(20,3)4)22(24)25-15-17-9-8-12-19(14-17)26-18-10-6-5-7-11-18/h5-14,20-21H,15H2,1-4H3
52 atoms
O  -2.045148 1.613802 -1.198859
O  -1.730692 -0.5544 -1.676336
O  2.649589 1.10825 1.016336
C  -4.286198 -1.06205 0.002461
C  -3.147039 -1.079901 0.96259
C  -3.314765 0.099722 -0.004569
C  -5.649981 -0.739231 0.57013
C  -4.353509 -2.038935 -1.145676
C  -2.014024 -2.027008 0.846544
C  -2.296127 0.302985 -1.050757
C  -0.865194 -1.933132 1.517929
C  0.212883 -2.959472 1.351187
C  -0.540689 -0.8123 2.458309
C  -1.033736 2.015294 -2.115866
C  0.22365 2.418277 -1.396176
C  0.86126 1.531416 -0.533448
C  0.763379 3.68273 -1.596514
C  2.028178 1.91808 0.108185
C  1.933171 4.057811 -0.953201
C  2.574247 3.176677 -0.100022
C  3.087119 -0.135704 0.678964
C  3.191163 -0.598428 -0.626738
C  3.472149 -0.946609 1.741588
C  3.670367 -1.881377 -0.854446
C  3.95748 -2.21884 1.495704
C  4.054501 -2.698129 0.196441
H  -3.40413 -0.810036 1.982832
H  -3.679459 1.019968 0.436577
H  -5.591837 -0.035954 1.401994
H  -6.135295 -1.645074 0.937828
H  -6.296942 -0.300014 -0.191211
H  -4.98537 -1.640469 -1.941325
H  -4.806077 -2.972402 -0.805327
H  -3.387046 -2.269891 -1.582078
H  -2.140839 -2.866631 0.17308
H  -0.093777 -3.767872 0.688663
H  0.494911 -3.397831 2.311974
H  1.119462 -2.511499 0.937834
H  -0.401186 -1.185848 3.476145
H  -1.305188 -0.038186 2.485296
H  0.400108 -0.333281 2.177124
H  -1.438116 2.867078 -2.664501
H  -0.827354 1.218716 -2.832819
H  0.460406 0.537949 -0.367634
H  0.264257 4.382949 -2.254897
H  2.345995 5.044855 -1.113352
H  3.484477 3.456404 0.413371
H  2.907118 0.024258 -1.463987
H  3.388734 -0.569785 2.752661
H  3.744117 -2.238835 -1.873076
H  4.254193 -2.842538 2.328552
H  4.425796 -3.695742 0.006446
totalener: -1117.84396255 hartree
nucrepener: 2344.55154107 hartree
electener: -3462.39550362 hartree
oneelecener: -6178.01579527 hartree
twoeener: 2715.62029164 hartree
kineticenergy: 1112.85241984 hartree
xcener: -110.235433781210 hartree
chargesum: 0.0000000
charge: -0.269286 -0.389466 -0.302350 0.139877 -0.069708 -0.088476 -0.239850 -0.286151 -0.127820 0.335292 -0.035892 -0.174125 -0.253271 0.060519 -0.018627 -0.192630 -0.170865 0.256991 -0.090261 -0.189024 0.267740 -0.173270 -0.236869 -0.108596 -0.084622 -0.155033 0.089478 0.080263 0.071297 0.088335 0.089694 0.085226 0.090792 0.103925 0.083359 0.078328 0.081518 0.050498 0.098487 0.086679 0.070963 0.090317 0.113477 0.160379 0.107901 0.125447 0.125227 0.131770 0.123275 0.125133 0.121428 0.122574
qa: -0.2693 -0.3895 -0.3023 0.1399 -0.0697 -0.0885 -0.2398 -0.2862 -0.1278 0.3353 -0.0359 -0.1741 -0.2533 0.0605 -0.0186 -0.1926 -0.1709 0.2570 -0.0903 -0.1890 0.2677 -0.1733 -0.2369 -0.1086 -0.0846 -0.1550 0.0895 0.0803 0.0713 0.0883 0.0897 0.0852 0.0908 0.1039 0.0834 0.0783 0.0815 0.0505 0.0985 0.0867 0.0710 0.0903 0.1135 0.1604 0.1079 0.1254 0.1252 0.1318 0.1233 0.1251 0.1214 0.1226
va: 2.1257 2.0880 2.0904 3.7472 3.8788 3.8608 3.8963 3.9127 3.8571 4.1734 3.7553 3.9521 3.9480 3.8741 3.8523 3.9586 3.9946 3.7483 3.9562 4.0715 3.7695 3.9250 3.9647 3.9523 3.9033 3.9515 1.0030 1.0325 1.0073 1.0045 1.0053 1.0040 0.9980 1.0213 1.0146 1.0176 1.0004 1.0055 1.0014 1.0111 1.0061 1.0001 1.0169 0.9883 1.0129 0.9997 1.0118 1.0062 1.0170 1.0006 1.0006 1.0020
dispcorr: -0.028700613 hartree
energy: -1117.872663161613
dipole: -15.80804 15.62713 -0.18091 -13.41623 13.80030 0.38407 5.45001 -5.42719 0.02281
magnitude: 0.42515 au
magnitude: 1.08066 debye
