program: Orca
programVersion: 5.0.2
elementType: O O O C C C C C C C C C C C C C C C C C C C C C C C H H H H H H H H H H H H H H H H H H H H H H H H H H
charge: 0
multiplicity: 1
keywords: wb97x-d3
keywords: def2-TZVPP
keywords: def2/J RIJCOSX
keywords: DEFGRID2
keywords: scfconv7
keywords: smallprint printgap noloewdin
keywords: NOSOSCF
formula: C23H26O3
InChI: InChI=1/C23H26O3/c1-16(2)13-20-21(23(20,3)4)22(24)25-15-17-9-8-12-19(14-17)26-18-10-6-5-7-11-18/h5-14,20-21H,15H2,1-4H3
52 atoms
O  -1.014182 -1.775791 0.951265
O  -2.560355 -0.494116 1.93458
O  3.575622 1.063465 0.299878
C  -4.416353 -1.154705 -0.43133
C  -3.502543 -0.123978 -1.001799
C  -2.923266 -1.343154 -0.279135
C  -5.073133 -2.102402 -1.409484
C  -5.29978 -0.833033 0.749676
C  -3.382581 1.243442 -0.438144
C  -2.194957 -1.141313 0.99002
C  -2.272638 1.981011 -0.465972
C  -2.236802 3.361985 0.11243
C  -0.973828 1.498548 -1.035157
C  -0.146647 -1.604032 2.072705
C  0.616285 -0.311754 1.98594
C  1.737474 -0.243962 1.165621
C  0.208771 0.814336 2.691042
C  2.443707 0.945436 1.048123
C  0.925622 1.996037 2.573206
C  2.03724 2.07258 1.750961
C  3.748086 0.277993 -0.803944
C  2.782935 0.201254 -1.800802
C  4.946583 -0.407188 -0.928759
C  3.027063 -0.573575 -2.923156
C  5.182498 -1.171307 -2.06222
C  4.224041 -1.262766 -3.059758
H  -3.363735 -0.178538 -2.079035
H  -2.474048 -2.090221 -0.923736
H  -4.437593 -2.307808 -2.272154
H  -6.008541 -1.681247 -1.782805
H  -5.304535 -3.056872 -0.933305
H  -4.852931 -0.135449 1.450036
H  -5.541575 -1.742856 1.301581
H  -6.239923 -0.406931 0.393361
H  -4.273272 1.667536 0.013989
H  -3.202137 3.662467 0.517681
H  -1.941149 4.099048 -0.638428
H  -1.499089 3.420466 0.916838
H  -0.199913 1.502359 -0.26288
H  -0.628855 2.166104 -1.829546
H  -1.031083 0.490823 -1.441961
H  0.535414 -2.452974 2.02671
H  -0.705135 -1.667039 3.007857
H  2.059326 -1.125816 0.624367
H  -0.671553 0.769853 3.316272
H  0.610596 2.873093 3.123247
H  2.597751 2.993121 1.654566
H  1.850856 0.743424 -1.701805
H  5.6871 -0.333737 -0.143115
H  2.275314 -0.633937 -3.699089
H  6.119829 -1.702936 -2.159705
H  4.408371 -1.864742 -3.939163
totalener: -1117.84410885 hartree
nucrepener: 2332.82738066 hartree
electener: -3450.67148951 hartree
oneelecener: -6154.50681830 hartree
twoeener: 2703.83532879 hartree
kineticenergy: 1112.86395794 hartree
xcener: -110.235749879869 hartree
chargesum: -0.0000000
charge: -0.263189 -0.389698 -0.298773 0.139785 -0.055064 -0.121005 -0.244413 -0.279608 -0.189564 0.360144 0.005874 -0.206887 -0.232111 0.036142 -0.023506 -0.166481 -0.107721 0.215429 -0.151921 -0.166433 0.184122 -0.110792 -0.173397 -0.158345 -0.112718 -0.119154 0.094055 0.084912 0.069933 0.086837 0.090548 0.107941 0.084676 0.085348 0.081822 0.078378 0.083366 0.084011 0.041766 0.105782 0.093512 0.105184 0.108464 0.114339 0.123633 0.128174 0.124583 0.151302 0.125609 0.123992 0.125680 0.125436
qa: -0.2632 -0.3897 -0.2988 0.1398 -0.0551 -0.1210 -0.2444 -0.2796 -0.1896 0.3601 0.0059 -0.2069 -0.2321 0.0361 -0.0235 -0.1665 -0.1077 0.2154 -0.1519 -0.1664 0.1841 -0.1108 -0.1734 -0.1583 -0.1127 -0.1192 0.0941 0.0849 0.0699 0.0868 0.0905 0.1079 0.0847 0.0853 0.0818 0.0784 0.0834 0.0840 0.0418 0.1058 0.0935 0.1052 0.1085 0.1143 0.1236 0.1282 0.1246 0.1513 0.1256 0.1240 0.1257 0.1254
va: 2.1208 2.0924 2.1091 3.7322 3.8904 3.8221 3.9047 3.9052 3.9103 4.1659 3.7884 3.9393 3.9299 3.8871 3.6795 3.9028 3.8818 3.8495 3.9448 3.9564 3.8728 3.9136 4.0128 3.9969 3.9447 3.9413 1.0055 1.0305 1.0072 1.0050 1.0049 1.0198 1.0054 0.9978 1.0109 1.0116 0.9992 0.9998 1.0172 1.0002 1.0052 0.9960 1.0097 1.0175 1.0256 1.0003 1.0127 0.9802 1.0129 1.0026 0.9994 1.0002
dispcorr: -0.028864184 hartree
energy: -1117.872973033715
dipole: -22.31227 22.43769 0.12542 2.16290 -2.56229 -0.39939 -6.98950 6.42093 -0.56857
magnitude: 0.70605 au
magnitude: 1.79464 debye
