program: Orca
programVersion: 5.0.2
elementType: O O O C C C C C C C C C C C C C C C C C C C C C C C H H H H H H H H H H H H H H H H H H H H H H H H H H
charge: 0
multiplicity: 1
keywords: wb97x-d3
keywords: def2-TZVPP
keywords: def2/J RIJCOSX
keywords: DEFGRID2
keywords: scfconv7
keywords: smallprint printgap noloewdin
keywords: NOSOSCF
formula: C23H26O3
InChI: InChI=1/C23H26O3/c1-16(2)13-20-21(23(20,3)4)22(24)25-15-17-9-8-12-19(14-17)26-18-10-6-5-7-11-18/h5-14,20-21H,15H2,1-4H3
52 atoms
O  -1.466106 1.23992 -0.836022
O  -1.351628 0.837236 1.361422
O  3.554064 0.854993 -1.604135
C  -1.618702 -2.155928 0.568372
C  -3.030579 -1.690532 0.676751
C  -2.034672 -0.894053 -0.160701
C  -1.33257 -3.341302 -0.323482
C  -0.707583 -2.08501 1.769261
C  -3.600158 -1.18404 1.950658
C  -1.583074 0.450678 0.249664
C  -4.456933 -0.170788 2.070227
C  -4.994712 0.239551 3.406946
C  -4.936617 0.649548 0.912673
C  -0.954164 2.544924 -0.625588
C  0.537838 2.561997 -0.427815
C  1.34823 1.650533 -1.09123
C  1.118318 3.537998 0.373232
C  2.726581 1.713669 -0.938709
C  2.496354 3.607187 0.499073
C  3.310335 2.691613 -0.148716
C  3.303715 -0.484391 -1.57024
C  3.617752 -1.21446 -2.708798
C  2.80768 -1.124147 -0.439953
C  3.441322 -2.588963 -2.713103
C  2.634768 -2.499816 -0.460851
C  2.945427 -3.239166 -1.592621
H  -3.740699 -2.234378 0.057244
H  -2.148592 -0.999283 -1.233453
H  -0.312115 -3.300551 -0.709184
H  -2.007659 -3.382536 -1.179553
H  -1.446128 -4.275308 0.230248
H  0.326436 -1.937539 1.45292
H  -0.753959 -3.028348 2.317603
H  -0.957062 -1.281231 2.455198
H  -3.305392 -1.714479 2.851064
H  -4.613486 -0.387538 4.211766
H  -6.08614 0.188081 3.427423
H  -4.725046 1.274168 3.632742
H  -4.635157 1.693316 1.033989
H  -6.028233 0.646288 0.861342
H  -4.558588 0.301125 -0.046049
H  -1.452015 3.032561 0.215736
H  -1.214689 3.095339 -1.531504
H  0.91215 0.887726 -1.724692
H  0.491327 4.241358 0.90688
H  2.943073 4.368427 1.124781
H  4.386688 2.728102 -0.046162
H  4.002612 -0.701196 -3.580266
H  2.563996 -0.559208 0.450874
H  3.68762 -3.15273 -3.603248
H  2.260187 -2.99789 0.424122
H  2.810022 -4.312162 -1.597806
totalener: -1117.84274068 hartree
nucrepener: 2326.24740894 hartree
electener: -3444.09014962 hartree
oneelecener: -6141.35385768 hartree
twoeener: 2697.26370806 hartree
kineticenergy: 1112.85721052 hartree
xcener: -110.233951625151 hartree
chargesum: -0.0000000
charge: -0.284013 -0.362260 -0.302148 0.142577 -0.051100 -0.065621 -0.240877 -0.277116 -0.209642 0.292105 0.012761 -0.211746 -0.257228 0.073952 0.073375 -0.206357 -0.180909 0.212141 -0.088978 -0.205897 0.232679 -0.208171 -0.126623 -0.089499 -0.173859 -0.143228 0.098210 0.087410 0.086608 0.070942 0.086004 0.060277 0.089482 0.114656 0.085775 0.077376 0.083100 0.088013 0.090974 0.096225 0.086571 0.097503 0.106064 0.129909 0.104628 0.124320 0.125473 0.124588 0.137050 0.124463 0.143326 0.126735
qa: -0.2840 -0.3623 -0.3021 0.1426 -0.0511 -0.0656 -0.2409 -0.2771 -0.2096 0.2921 0.0128 -0.2117 -0.2572 0.0740 0.0734 -0.2064 -0.1809 0.2121 -0.0890 -0.2059 0.2327 -0.2082 -0.1266 -0.0895 -0.1739 -0.1432 0.0982 0.0874 0.0866 0.0709 0.0860 0.0603 0.0895 0.1147 0.0858 0.0774 0.0831 0.0880 0.0910 0.0962 0.0866 0.0975 0.1061 0.1299 0.1046 0.1243 0.1255 0.1246 0.1371 0.1245 0.1433 0.1267
va: 2.0952 2.1173 2.1035 3.7011 3.9245 3.7744 3.9041 3.9118 3.9166 4.1628 3.7335 3.9427 3.9473 3.8733 3.6646 3.9555 4.0309 3.8395 3.9433 4.0522 3.8445 4.0309 3.8740 3.9444 3.9261 3.9458 1.0038 1.0307 1.0111 1.0101 1.0040 1.0224 0.9983 1.0203 1.0114 1.0111 0.9985 0.9990 1.0002 1.0011 1.0089 1.0135 0.9860 1.0217 1.0120 0.9996 1.0118 1.0140 1.0047 0.9982 0.9881 1.0006
dispcorr: -0.027605755 hartree
energy: -1117.870346435374
dipole: -22.16329 21.69421 -0.46908 -10.94227 10.77579 -0.16648 10.82243 -11.09977 -0.27734
magnitude: 0.56980 au
magnitude: 1.44831 debye
