program: Orca
programVersion: 5.0.2
elementType: O O O C C C C C C C C C C C C C C C C C C C C C C C H H H H H H H H H H H H H H H H H H H H H H H H H H
charge: 0
multiplicity: 1
keywords: wb97x-d3
keywords: def2-TZVPP
keywords: def2/J RIJCOSX
keywords: DEFGRID2
keywords: scfconv7
keywords: smallprint printgap noloewdin
keywords: NOSOSCF
formula: C23H26O3
InChI: InChI=1/C23H26O3/c1-16(2)13-20-21(23(20,3)4)22(24)25-15-17-9-8-12-19(14-17)26-18-10-6-5-7-11-18/h5-14,20-21H,15H2,1-4H3
52 atoms
O  -2.347386 1.929332 -0.611978
O  -2.199932 -0.029388 -1.687503
O  2.775643 0.165539 -1.161333
C  -4.471804 -1.020792 0.153583
C  -3.243144 -1.16805 0.982039
C  -3.540112 0.16637 0.290003
C  -5.782831 -0.876577 0.893152
C  -4.619022 -1.768778 -1.149346
C  -2.092421 -2.009994 0.573458
C  -2.640795 0.631286 -0.784354
C  -0.830397 -1.786443 0.940288
C  0.288462 -2.666921 0.47701
C  -0.426997 -0.61743 1.787053
C  -1.454771 2.544208 -1.541267
C  -0.025746 2.475424 -1.076823
C  0.739186 1.332121 -1.293669
C  0.54547 3.557523 -0.418733
C  2.056885 1.288306 -0.867529
C  1.867783 3.508199 -0.002144
C  2.635066 2.378584 -0.228483
C  3.475316 -0.495991 -0.198578
C  4.442583 -1.385315 -0.652651
C  3.231393 -0.366331 1.163572
C  5.159966 -2.14431 0.255691
C  3.963176 -1.130833 2.06107
C  4.927761 -2.021569 1.618608
H  -3.404416 -1.117658 2.056355
H  -3.884572 0.960222 0.942618
H  -6.513629 -0.332821 0.292142
H  -5.665067 -0.34087 1.83602
H  -6.203585 -1.85727 1.121967
H  -5.052244 -2.75188 -0.954552
H  -3.683481 -1.909202 -1.680836
H  -5.300002 -1.23873 -1.817199
H  -2.304066 -2.86089 -0.065156
H  0.856073 -3.069434 1.319041
H  1.0001 -2.101688 -0.128961
H  -0.071666 -3.502036 -0.122283
H  0.085007 0.132727 1.178168
H  0.274129 -0.92284 2.566691
H  -1.270418 -0.123073 2.264855
H  -1.776492 3.584202 -1.599696
H  -1.56369 2.09962 -2.53128
H  0.314573 0.474374 -1.799373
H  -0.041103 4.450174 -0.239993
H  2.309634 4.361273 0.495403
H  3.671289 2.34603 0.083052
H  4.618671 -1.479742 -1.716065
H  2.474019 0.311739 1.531726
H  5.908915 -2.835898 -0.106895
H  3.766759 -1.026316 3.120139
H  5.49113 -2.614545 2.325962
totalener: -1117.84312362 hartree
nucrepener: 2341.67991459 hartree
electener: -3459.52303821 hartree
oneelecener: -6172.26884406 hartree
twoeener: 2712.74580585 hartree
kineticenergy: 1112.85847558 hartree
xcener: -110.236022361496 hartree
chargesum: 0.0000000
charge: -0.267348 -0.395251 -0.291742 0.135439 -0.057196 -0.112906 -0.243046 -0.279953 -0.168027 0.365324 0.012917 -0.209489 -0.264542 0.048008 0.034451 -0.250234 -0.165996 0.248062 -0.098108 -0.188571 0.267656 -0.214861 -0.175028 -0.090827 -0.142573 -0.140700 0.089855 0.081032 0.090242 0.069787 0.088064 0.087139 0.106475 0.084800 0.083429 0.084625 0.080224 0.083623 0.072139 0.093403 0.095933 0.095588 0.114714 0.146168 0.108093 0.126914 0.134633 0.123989 0.132338 0.123617 0.124006 0.123713
qa: -0.2673 -0.3953 -0.2917 0.1354 -0.0572 -0.1129 -0.2430 -0.2800 -0.1680 0.3653 0.0129 -0.2095 -0.2645 0.0480 0.0345 -0.2502 -0.1660 0.2481 -0.0981 -0.1886 0.2677 -0.2149 -0.1750 -0.0908 -0.1426 -0.1407 0.0899 0.0810 0.0902 0.0698 0.0881 0.0871 0.1065 0.0848 0.0834 0.0846 0.0802 0.0836 0.0721 0.0934 0.0959 0.0956 0.1147 0.1462 0.1081 0.1269 0.1346 0.1240 0.1323 0.1236 0.1240 0.1237
va: 2.1199 2.0847 2.0896 3.7367 3.8976 3.8374 3.9034 3.9082 3.8766 4.1403 3.6967 3.9489 3.9502 3.8703 3.6758 3.9598 4.0247 3.8023 3.9399 3.9781 3.7061 4.0359 3.8662 3.9467 3.9881 3.9656 1.0065 1.0326 1.0049 1.0072 1.0048 0.9978 1.0196 1.0050 1.0126 1.0011 1.0004 1.0148 1.0092 1.0028 1.0142 0.9975 1.0135 1.0303 1.0116 1.0000 1.0031 1.0152 0.9983 0.9988 1.0016 1.0004
dispcorr: -0.029607930 hartree
energy: -1117.872731553174
dipole: -15.42659 15.39287 -0.03372 -10.81583 11.30704 0.49121 8.57809 -7.85446 0.72363
magnitude: 0.87525 au
magnitude: 2.22471 debye
