program: Orca
programVersion: 5.0.2
elementType: O O O C C C C C C C C C C C C C C C C C C C C C C C H H H H H H H H H H H H H H H H H H H H H H H H H H
charge: 0
multiplicity: 1
keywords: wb97x-d3
keywords: def2-TZVPP
keywords: def2/J RIJCOSX
keywords: DEFGRID2
keywords: scfconv7
keywords: smallprint printgap noloewdin
keywords: NOSOSCF
formula: C23H26O3
InChI: InChI=1/C23H26O3/c1-16(2)13-20-21(23(20,3)4)22(24)25-15-17-9-8-12-19(14-17)26-18-10-6-5-7-11-18/h5-14,20-21H,15H2,1-4H3
52 atoms
O  -2.344711 0.682047 -1.310608
O  -3.100631 2.584152 -0.409953
O  3.148831 -0.414551 -1.279106
C  -4.753159 -0.775217 -0.257464
C  -3.854162 -0.675429 0.928905
C  -4.212583 0.583123 0.134521
C  -6.229891 -0.951831 0.022324
C  -4.323701 -1.503634 -1.508627
C  -2.469648 -1.210123 0.942282
C  -3.177695 1.390176 -0.549026
C  -1.488819 -0.739707 1.712439
C  -0.112547 -1.326196 1.672924
C  -1.655647 0.418691 2.646853
C  -1.291064 1.363896 -1.991407
C  -0.009153 1.360887 -1.205617
C  0.993509 0.460936 -1.536334
C  0.196174 2.259982 -0.161269
C  2.200907 0.463102 -0.848089
C  1.397966 2.247912 0.526556
C  2.409954 1.358873 0.191489
C  4.109776 -0.849273 -0.409225
C  5.439114 -0.657917 -0.750885
C  3.769962 -1.510591 0.764388
C  6.435599 -1.135752 0.088078
C  4.773994 -1.976625 1.597388
C  6.108942 -1.790811 1.265268
H  -4.357923 -0.715744 1.891596
H  -4.927931 1.237877 0.618818
H  -6.831867 -0.566499 -0.802527
H  -6.540819 -0.431213 0.928989
H  -6.474209 -2.008136 0.148378
H  -4.808768 -1.0749 -2.386997
H  -4.637111 -2.547271 -1.440565
H  -3.253282 -1.48971 -1.684075
H  -2.252839 -2.044306 0.283154
H  0.61117 -0.564603 1.371872
H  -0.040575 -2.157598 0.972258
H  0.194521 -1.684485 2.659184
H  -1.43607 0.122514 3.675932
H  -2.655361 0.847272 2.626572
H  -0.949427 1.21271 2.392671
H  -1.591903 2.383767 -2.233974
H  -1.156664 0.81826 -2.925473
H  0.851981 -0.247142 -2.34412
H  -0.575442 2.971152 0.100124
H  1.563094 2.952827 1.330899
H  3.348487 1.376643 0.729657
H  5.685668 -0.14234 -1.669692
H  2.729374 -1.664652 1.020416
H  7.473157 -0.987025 -0.180067
H  4.509082 -2.494129 2.509883
H  6.888528 -2.158562 1.918428
totalener: -1117.84049289 hartree
nucrepener: 2313.60234358 hartree
electener: -3431.44283647 hartree
oneelecener: -6115.81086275 hartree
twoeener: 2684.36802627 hartree
kineticenergy: 1112.86450953 hartree
xcener: -110.237026405245 hartree
chargesum: -0.0000000
charge: -0.250784 -0.382714 -0.296255 0.147312 -0.057429 -0.141124 -0.248763 -0.268670 -0.178490 0.365940 -0.014673 -0.205352 -0.247197 0.015376 0.062897 -0.217077 -0.210579 0.205243 -0.125152 -0.130864 0.156571 -0.150572 -0.087689 -0.124505 -0.172104 -0.107991 0.093253 0.089264 0.092046 0.072169 0.086354 0.090932 0.087962 0.083614 0.082689 0.049154 0.089140 0.102340 0.095460 0.087938 0.091199 0.122760 0.089155 0.104249 0.150189 0.130315 0.125910 0.126356 0.143967 0.126259 0.125360 0.126608
qa: -0.2508 -0.3827 -0.2963 0.1473 -0.0574 -0.1411 -0.2488 -0.2687 -0.1785 0.3659 -0.0147 -0.2054 -0.2472 0.0154 0.0629 -0.2171 -0.2106 0.2052 -0.1252 -0.1309 0.1566 -0.1506 -0.0877 -0.1245 -0.1721 -0.1080 0.0933 0.0893 0.0920 0.0722 0.0864 0.0909 0.0880 0.0836 0.0827 0.0492 0.0891 0.1023 0.0955 0.0879 0.0912 0.1228 0.0892 0.1042 0.1502 0.1303 0.1259 0.1264 0.1440 0.1263 0.1254 0.1266
va: 2.1045 2.1188 2.1038 3.7104 3.8707 3.8340 3.9092 3.9089 3.8688 4.1996 3.7818 3.9247 3.9386 3.8734 3.6388 4.0462 3.8997 3.8754 3.9269 3.8639 3.8735 3.9979 3.9023 3.9505 4.0138 3.9281 1.0061 1.0284 1.0041 1.0080 1.0046 1.0049 0.9999 1.0180 1.0140 1.0006 1.0051 1.0017 1.0012 1.0108 1.0060 1.0109 1.0034 1.0252 1.0200 1.0020 1.0098 1.0117 0.9890 0.9996 1.0025 0.9998
dispcorr: -0.029512561 hartree
energy: -1117.870005455424
dipole: -17.21122 17.59945 0.38823 -8.32180 7.62334 -0.69846 8.81359 -8.52465 0.28893
magnitude: 0.84974 au
magnitude: 2.15986 debye
