program: Orca
programVersion: 5.0.2
elementType: O O O C C C C C C C C C C C C C C C C C C C C C C C H H H H H H H H H H H H H H H H H H H H H H H H H H
charge: 0
multiplicity: 1
keywords: wb97x-d3
keywords: def2-TZVPP
keywords: def2/J RIJCOSX
keywords: DEFGRID2
keywords: scfconv7
keywords: smallprint printgap noloewdin
keywords: NOSOSCF
formula: C23H26O3
InChI: InChI=1/C23H26O3/c1-16(2)13-20-21(23(20,3)4)22(24)25-15-17-9-8-12-19(14-17)26-18-10-6-5-7-11-18/h5-14,20-21H,15H2,1-4H3
52 atoms
O  -1.341339 -1.7763 0.139365
O  -2.573875 -0.810343 1.735622
O  3.164484 1.044595 -0.72876
C  -4.854921 -0.662606 -0.346198
C  -3.98597 0.502204 -0.675295
C  -3.370409 -0.893216 -0.52638
C  -5.714734 -1.20967 -1.463441
C  -5.514545 -0.776549 1.006376
C  -3.688071 1.583804 0.295568
C  -2.433539 -1.138779 0.587934
C  -2.562725 2.298158 0.306591
C  -2.331135 3.37753 1.318454
C  -1.432608 2.071595 -0.648696
C  -0.267687 -1.958654 1.060526
C  0.574779 -0.718032 1.173528
C  1.498588 -0.430895 0.175905
C  0.423909 0.161652 2.240857
C  2.274016 0.718003 0.253388
C  1.196381 1.311015 2.305452
C  2.128045 1.594209 1.317906
C  4.085988 0.124855 -1.134183
C  4.641633 -0.809654 -0.268317
C  4.496796 0.185141 -2.45919
C  5.606829 -1.685179 -0.742079
C  5.468414 -0.691288 -2.915405
C  6.02546 -1.633369 -2.062935
H  -4.025175 0.826472 -1.712444
H  -3.077512 -1.372394 -1.453565
H  -5.926478 -2.269418 -1.311356
H  -5.236547 -1.103533 -2.43827
H  -6.669192 -0.681917 -1.506299
H  -4.913848 -0.379342 1.817993
H  -5.729391 -1.82152 1.236283
H  -6.467075 -0.242897 0.992073
H  -4.447988 1.801408 1.038964
H  -2.151964 4.342442 0.837383
H  -1.442569 3.154885 1.91472
H  -3.174097 3.490407 1.998976
H  -0.523861 1.79817 -0.106671
H  -1.201469 2.986659 -1.200317
H  -1.633521 1.285289 -1.37338
H  0.318087 -2.779141 0.645743
H  -0.640907 -2.267547 2.038119
H  1.616396 -1.105078 -0.66491
H  -0.308165 -0.04638 3.008487
H  1.077122 1.993198 3.136783
H  2.738555 2.486424 1.364666
H  4.331557 -0.85322 0.767647
H  4.055658 0.919347 -3.120556
H  6.039404 -2.409563 -0.06454
H  5.786257 -0.640327 -3.948458
H  6.780009 -2.318708 -2.423974
totalener: -1117.84393617 hartree
nucrepener: 2289.59160458 hartree
electener: -3407.43554075 hartree
oneelecener: -6068.11553656 hartree
twoeener: 2660.67999581 hartree
kineticenergy: 1112.86311599 hartree
xcener: -110.234880204987 hartree
chargesum: -0.0000000
charge: -0.265372 -0.388584 -0.303513 0.140299 -0.052117 -0.114347 -0.244574 -0.280825 -0.190053 0.354470 0.003804 -0.207129 -0.209139 0.040399 -0.007493 -0.166553 -0.104903 0.195113 -0.150756 -0.162651 0.241788 -0.150568 -0.213750 -0.125166 -0.090284 -0.147419 0.093610 0.083416 0.090105 0.070125 0.087459 0.107261 0.084184 0.086186 0.081723 0.084612 0.080855 0.078460 0.045084 0.098263 0.084087 0.107341 0.107688 0.118222 0.124501 0.129591 0.126906 0.129766 0.124585 0.126248 0.124615 0.124428
qa: -0.2654 -0.3886 -0.3035 0.1403 -0.0521 -0.1143 -0.2446 -0.2808 -0.1901 0.3545 0.0038 -0.2071 -0.2091 0.0404 -0.0075 -0.1666 -0.1049 0.1951 -0.1508 -0.1627 0.2418 -0.1506 -0.2137 -0.1252 -0.0903 -0.1474 0.0936 0.0834 0.0901 0.0701 0.0875 0.1073 0.0842 0.0862 0.0817 0.0846 0.0809 0.0785 0.0451 0.0983 0.0841 0.1073 0.1077 0.1182 0.1245 0.1296 0.1269 0.1298 0.1246 0.1262 0.1246 0.1244
va: 2.1181 2.0940 2.0981 3.7292 3.8925 3.8212 3.9043 3.9049 3.8971 4.1701 3.7454 3.9430 3.9447 3.8861 3.6516 3.9389 3.8797 3.8431 3.9246 3.9769 3.8155 3.9109 4.0325 3.9574 3.9407 3.9609 1.0058 1.0311 1.0048 1.0073 1.0049 1.0198 1.0050 0.9978 1.0128 0.9994 0.9998 1.0116 1.0190 1.0056 1.0117 0.9940 1.0109 1.0147 1.0248 1.0006 1.0110 1.0066 1.0146 1.0001 0.9986 1.0006
dispcorr: -0.027734247 hartree
energy: -1117.871670417986
dipole: -22.61699 22.84807 0.23108 4.75216 -5.05599 -0.30383 -0.71435 0.38742 -0.32693
magnitude: 0.50259 au
magnitude: 1.27747 debye
