program: Orca
programVersion: 5.0.2
elementType: O O O C C C C C C C C C C C C C C C C C C C C C C C H H H H H H H H H H H H H H H H H H H H H H H H H H
charge: 0
multiplicity: 1
keywords: wb97x-d3
keywords: def2-TZVPP
keywords: def2/J RIJCOSX
keywords: DEFGRID2
keywords: scfconv7
keywords: smallprint printgap noloewdin
keywords: NOSOSCF
formula: C23H26O3
InChI: InChI=1/C23H26O3/c1-16(2)13-20-21(23(20,3)4)22(24)25-15-17-9-8-12-19(14-17)26-18-10-6-5-7-11-18/h5-14,20-21H,15H2,1-4H3
52 atoms
O  -1.689795 1.963388 -0.830068
O  -1.122442 1.171135 1.182279
O  2.916342 0.43571 -2.128219
C  -1.90068 -1.562494 -0.196354
C  -3.104525 -1.167531 0.60206
C  -2.453717 -0.152537 -0.328401
C  -2.124891 -2.457036 -1.392055
C  -0.582959 -1.817865 0.49057
C  -3.091542 -1.051273 2.072745
C  -1.6936 1.025258 0.135557
C  -3.95935 -1.630784 2.906966
C  -3.82387 -1.448262 4.389824
C  -5.108727 -2.503338 2.498948
C  -0.914683 3.125296 -0.613827
C  0.547095 2.938601 -0.931578
C  1.059484 1.73795 -1.393876
C  1.404034 4.025362 -0.772314
C  2.416034 1.624412 -1.670467
C  2.748963 3.90919 -1.074442
C  3.269784 2.701434 -1.51959
C  2.933211 -0.629218 -1.27735
C  2.974274 -1.891282 -1.858918
C  2.942742 -0.494545 0.105968
C  3.034788 -3.016241 -1.053143
C  3.000599 -1.631949 0.898269
C  3.047099 -2.894916 0.329526
H  -4.04119 -1.529065 0.191474
H  -2.999343 0.035824 -1.245793
H  -2.102183 -3.506665 -1.092514
H  -1.345066 -2.309291 -2.14183
H  -3.087265 -2.271134 -1.871252
H  0.246891 -1.697248 -0.207678
H  -0.556492 -2.846632 0.853476
H  -0.395372 -1.165021 1.337115
H  -2.303609 -0.451366 2.508831
H  -3.661514 -2.406118 4.891359
H  -4.734964 -1.023363 4.819366
H  -2.994705 -0.790786 4.647083
H  -5.002712 -3.501503 2.931384
H  -5.211522 -2.62699 1.423223
H  -6.051705 -2.101514 2.877831
H  -1.025412 3.483873 0.412926
H  -1.340296 3.879918 -1.277753
H  0.423075 0.877049 -1.552231
H  1.015135 4.970616 -0.412136
H  3.403966 4.761468 -0.952014
H  4.32211 2.594032 -1.746385
H  2.964706 -1.980266 -2.937439
H  2.902186 0.482074 0.569548
H  3.067146 -3.995586 -1.512324
H  3.004969 -1.521494 1.974645
H  3.089871 -3.775413 0.955898
totalener: -1117.84447113 hartree
nucrepener: 2315.75654814 hartree
electener: -3433.60101927 hartree
oneelecener: -6120.34317673 hartree
twoeener: 2686.74215747 hartree
kineticenergy: 1112.84610832 hartree
xcener: -110.235470533064 hartree
chargesum: 0.0000000
charge: -0.277907 -0.377473 -0.300953 0.121808 0.023962 -0.087453 -0.237986 -0.235988 -0.225629 0.301493 -0.042970 -0.207376 -0.242600 0.045000 0.044969 -0.137435 -0.183914 0.179080 -0.103566 -0.169624 0.232127 -0.197053 -0.134080 -0.089860 -0.141781 -0.151209 0.087168 0.085067 0.088442 0.089220 0.071407 0.046590 0.091768 0.103138 0.112051 0.081666 0.080960 0.081426 0.085998 0.076023 0.086468 0.112254 0.117435 0.117971 0.109955 0.125524 0.126286 0.122478 0.126902 0.122673 0.125534 0.122013
qa: -0.2779 -0.3775 -0.3010 0.1218 0.0240 -0.0875 -0.2380 -0.2360 -0.2256 0.3015 -0.0430 -0.2074 -0.2426 0.0450 0.0450 -0.1374 -0.1839 0.1791 -0.1036 -0.1696 0.2321 -0.1971 -0.1341 -0.0899 -0.1418 -0.1512 0.0872 0.0851 0.0884 0.0892 0.0714 0.0466 0.0918 0.1031 0.1121 0.0817 0.0810 0.0814 0.0860 0.0760 0.0865 0.1123 0.1174 0.1180 0.1100 0.1255 0.1263 0.1225 0.1269 0.1227 0.1255 0.1220
va: 2.1215 2.0996 2.0992 3.7335 3.8100 3.8958 3.9056 3.9073 3.8943 4.1809 3.7980 3.9398 3.9462 3.8844 3.6927 4.0037 4.0067 3.8842 3.9345 4.0184 3.7973 3.9928 3.8590 3.9303 3.9288 3.9296 1.0103 1.0304 1.0039 1.0052 1.0089 1.0158 1.0075 1.0173 1.0294 0.9979 0.9982 1.0125 0.9993 1.0163 0.9990 1.0107 0.9865 1.0109 1.0080 0.9999 1.0100 1.0154 1.0111 0.9989 1.0016 1.0018
dispcorr: -0.027201031 hartree
energy: -1117.871672156436
dipole: -20.08576 19.66798 -0.41778 -17.18019 17.11818 -0.06201 13.33209 -13.43992 -0.10783
magnitude: 0.43591 au
magnitude: 1.10799 debye
