program: Gaussian 09
title: 000067712
version: EM64L-G09RevD.01
frameworkgroup: C1[X(C2HCl2FO2)]
method: RPBEPBE
basis: SDD
operation: Freq
keyword: #p
keyword: freq=noraman
keyword: PBEPBE/SDD
title: #p freq=noraman PBEPBE/SDD
converged: NO NO NO NO
title: Mulliken charges:
elementType: Cl Cl F O O C C H
charge: 0.102611 0.102669 -0.088518 -0.371282 -0.171341 -0.287821 0.310229 0.403452
chargesum: 0.00000
title: Mulliken charges with hydrogens summed into heavy atoms:
elementType: Cl Cl F O O C C
charge: 0.102611 0.102669 -0.088518 0.032171 -0.171341 -0.287821 0.310229
polarizability: 4.79717839e+01 -2.42159728e-02 4.99637482e+01 -4.41380034e+00 -2.00363061e-03 4.14518634e+01
1716.lowfreq: -29.1242 -16.0142 -12.4548 -4.1740 0.0016 0.0022 0.0024 173.5835 198.7814
frequency: -28.4619 173.5765 198.7795 249.9978 328.5072 341.3616 391.3172 508.0702 561.0820 604.2933 671.1712 782.5465 891.9640 1018.7627 1069.3046 1318.3129 1664.9930 3525.3135
redmass: 10.3909 13.7726 19.9826 16.0206 12.1892 20.9681 18.3751 15.3089 1.8096 4.3699 2.4561 11.7561 12.6227 11.8826 2.4268 2.3816 11.1515 1.0645
irintensity: 1.7247 0.0089 0.3173 1.2189 1.9117 0.2270 0.1268 1.9319 7.3257 115.0123 268.7518 155.3604 125.4688 60.1952 240.8279 34.4084 196.3825 57.1412
temp: 298.150 k
press: 1.00000 atm
elementType: 17 17 9 8 8 6 6 1
symmnumber: 1
zpe: 85529.1 jmol-1
zpe.correction: 0.032576 hartree
zpe.thermalcorrener: 0.039034 hartree
zpe.thermalcorrenthalpy: 0.039978 hartree
zpe.thermalcorrgfe: 0.001056 hartree
zpe.sumelectzpe: -1246.657565 hartree
zpe.sumelectthermal: -1246.651108 hartree
zpe.sumelectthermalent: -1246.650164 hartree
zpe.sumelectthermalfe: -1246.689086 hartree
dipole: -2.0242 -0.0006 0.3765
dipole: 2.0589
quadrupole: -43.3763 -51.5106 -60.1608
quadrupole: 0.0029 -2.0621 -0.0112
quadrupole: 8.3063 0.1719 -8.4782 0.0029 -2.0621 -0.0112
hfenergy: -1246.6901417 hartree
pointgroup: C01 [X(C2H1Cl2F1O2)]
dipole: -0.7390128 -0.331728 -0.0000422 debye
dipolederiv: -0.2195813 -0.0807378 0.2060794 -0.0884832 -0.1799359 0.2033561 0.1274811 0.1763852 -0.5892466 -0.2190028 -0.0796653 -0.2054837 -0.087687 -0.1786767 -0.2021694 -0.1271261 -0.1751822 -0.5910336 -0.3098534 0.1667838 0.0003402 0.0308051 -0.8867577 -0.0009329 0.0000827 -0.0008364 -0.3082106 -0.6019421 -0.5699238 -0.000468 -0.3970908 -0.9177495 -0.000464 -0.0001228 0.0003045 -0.379077 -0.6460401 0.2085248 -0.0002891 0.0438799 -0.8132066 0.0002347 0.0001804 -0.0008158 -0.2565787 0.53266 -0.045589 -0.0010319 0.2535255 1.2767569 -0.0004418 -0.000938 -0.0004659 1.6471147 1.2517659 0.2847039 0.0007167 0.1241582 1.4091792 0.0004737 0.000203 0.0006837 0.0559721 0.2119937 0.1159033 0.0001364 0.1208923 0.2903903 -0.0000564 0.0002397 -0.0000731 0.4210597 unknown
polarizability: 45.5867453|5.416974|43.8369048|-0.0106694|-0.0193186|49.9637454 unknown
InChI: InChI=1S/C2HCl2FO2/c3-2(4,5)1(6)7/h6H
charge 0 multiplicity 1
8 atoms
Cl 1.307062 0.654198 -1.5232
Cl 1.304294 0.64933 1.526666
F  0.905714 -1.486478 -0.002042
O  -1.627848 -1.07399 -0.000879
O  -1.477112 1.255294 0.0005
C  0.581316 -0.117787 -0.000133
C  -0.951537 0.129676 -0.001107
H  -2.60889 -0.904843 -0.000206
