program: Orca
programVersion: 5.0.2
elementType: O O O C C C C C C C C C C C C C C C C C C C C C C C H H H H H H H H H H H H H H H H H H H H H H H H H H
charge: 0
multiplicity: 1
keywords: wb97x-d3
keywords: def2-TZVPP
keywords: def2/J RIJCOSX
keywords: DEFGRID2
keywords: scfconv7
keywords: smallprint printgap noloewdin
keywords: NOSOSCF
formula: C23H26O3
InChI: InChI=1/C23H26O3/c1-16(2)13-20-21(23(20,3)4)22(24)25-15-17-9-8-12-19(14-17)26-18-10-6-5-7-11-18/h5-14,20-21H,15H2,1-4H3
52 atoms
O  0.753631 -2.641425 -1.066155
O  0.233769 -2.269902 1.075957
O  2.622955 1.995253 -0.484679
C  -2.710467 -2.037687 0.030793
C  -2.101131 -0.673503 0.001427
C  -1.370863 -1.828841 -0.653856
C  -3.864842 -2.32972 -0.896028
C  -2.809539 -2.76869 1.346469
C  -2.612919 0.426544 -0.855461
C  -0.084214 -2.26599 -0.091404
C  -3.580239 1.273023 -0.495184
C  -4.009084 2.394698 -1.389086
C  -4.288431 1.19557 0.820973
C  2.1068 -2.904425 -0.718333
C  2.880273 -1.655145 -0.387229
C  2.365202 -0.385413 -0.605064
C  4.167104 -1.789319 0.129814
C  3.120462 0.731263 -0.269762
C  4.921707 -0.666851 0.426125
C  4.399318 0.607356 0.241771
C  1.398925 2.321832 0.045416
C  0.626623 3.229485 -0.667511
C  0.956892 1.820006 1.263915
C  -0.588793 3.649911 -0.146984
C  -0.265094 2.245264 1.768105
C  -1.041593 3.160691 1.07121
H  -1.670781 -0.360117 0.950034
H  -1.40951 -1.845443 -1.737319
H  -4.801759 -1.984136 -0.453768
H  -3.95686 -3.403383 -1.069551
H  -3.757557 -1.843257 -1.865128
H  -2.093201 -2.422008 2.087494
H  -2.670035 -3.843316 1.214489
H  -3.806727 -2.61965 1.765429
H  -2.146073 0.55452 -1.82785
H  -3.881429 3.360076 -0.891452
H  -5.070515 2.315215 -1.637613
H  -3.443601 2.418225 -2.320249
H  -3.995625 0.332394 1.417069
H  -5.370433 1.150915 0.6757
H  -4.095685 2.093956 1.414039
H  2.533405 -3.38715 -1.597673
H  2.16925 -3.619137 0.104992
H  1.382837 -0.238208 -1.036522
H  4.5789 -2.776697 0.299624
H  5.921585 -0.780272 0.822955
H  4.977078 1.487083 0.493054
H  0.978732 3.60859 -1.618438
H  1.555434 1.115338 1.826974
H  -1.1886 4.357337 -0.704775
H  -0.606607 1.856146 2.718464
H  -1.992805 3.485728 1.471532
elementType: O C H
totalener: -1117.85524822 hartree
nucrepener: 2372.73816679 hartree
electener: -3490.59341501 hartree
oneelecener: -6235.71237296 hartree
twoeener: 2745.11895795 hartree
cpcmener: -0.03130508 hartree
kineticenergy: 1112.80504831 hartree
xcener: -110.232231842624 hartree
chargesum: 0.0000000
charge: -0.299988 -0.488312 -0.345900 0.139046 -0.063669 -0.040426 -0.281178 -0.303038 -0.230274 0.365397 -0.055363 -0.242078 -0.251922 0.090911 0.018183 -0.186602 -0.230506 0.236810 -0.126839 -0.229599 0.279265 -0.229905 -0.168192 -0.157441 -0.188268 -0.152131 0.105015 0.094435 0.098014 0.102862 0.093091 0.091741 0.106188 0.095741 0.123145 0.089822 0.108062 0.094746 0.092519 0.106693 0.098306 0.131346 0.119487 0.152312 0.146639 0.161401 0.149396 0.146684 0.153284 0.158500 0.160993 0.161595
qa: -0.3000 -0.4883 -0.3459 0.1390 -0.0637 -0.0404 -0.2812 -0.3030 -0.2303 0.3654 -0.0554 -0.2421 -0.2519 0.0909 0.0182 -0.1866 -0.2305 0.2368 -0.1268 -0.2296 0.2793 -0.2299 -0.1682 -0.1574 -0.1883 -0.1521 0.1050 0.0944 0.0980 0.1029 0.0931 0.0917 0.1062 0.0957 0.1231 0.0898 0.1081 0.0947 0.0925 0.1067 0.0983 0.1313 0.1195 0.1523 0.1466 0.1614 0.1494 0.1467 0.1533 0.1585 0.1610 0.1616
va: 2.1113 2.0005 2.0550 3.7550 3.7891 3.8283 3.9097 3.8912 3.7718 4.1607 3.6945 3.9221 3.9233 3.7975 3.6363 3.9284 3.9703 3.7472 3.8782 4.0042 3.6794 3.9966 3.8215 3.8713 3.8660 3.8113 1.0228 1.0346 0.9995 1.0031 1.0021 1.0193 0.9989 1.0005 1.0076 0.9947 0.9990 1.0058 1.0060 0.9995 1.0019 0.9918 1.0105 1.0055 0.9989 0.9875 1.0040 1.0076 1.0011 0.9901 0.9926 0.9850
dispcorr: -0.030225014 hartree
energy: -1117.885473231796
dipole: -29.62921 28.77960 -0.84961 -0.78753 0.48343 -0.30410 0.98303 -1.52688 -0.54385
magnitude: 1.05361 au
magnitude: 2.67805 debye
