program: Orca
programVersion: 5.0.2
elementType: O O O C C C C C C C C C C C C C C C C C C C C C C C H H H H H H H H H H H H H H H H H H H H H H H H H H
charge: 0
multiplicity: 1
keywords: wb97x-d3
keywords: def2-TZVPP
keywords: def2/J RIJCOSX
keywords: DEFGRID2
keywords: scfconv7
keywords: smallprint printgap noloewdin
keywords: NOSOSCF
formula: C23H26O3
InChI: InChI=1/C23H26O3/c1-16(2)13-20-21(23(20,3)4)22(24)25-15-17-9-8-12-19(14-17)26-18-10-6-5-7-11-18/h5-14,20-21H,15H2,1-4H3
52 atoms
O  0.721814 -2.309575 -1.208483
O  0.20893 -2.117264 0.95939
O  3.001001 2.065692 -0.152241
C  -2.710064 -2.271767 -0.26697
C  -2.40301 -0.876483 0.186457
C  -1.42417 -1.592826 -0.716328
C  -3.750508 -2.479651 -1.339811
C  -2.673193 -3.388948 0.744995
C  -3.132708 0.29924 -0.341295
C  -0.11233 -2.022917 -0.203315
C  -3.932067 1.10389 0.365075
C  -4.600157 2.282335 -0.27503
C  -4.230207 0.929192 1.821757
C  2.050394 -2.70743 -0.881097
C  2.872814 -1.591777 -0.297421
C  2.549611 -0.263411 -0.534688
C  3.991139 -1.900118 0.471547
C  3.310868 0.743068 0.04335
C  4.771139 -0.883886 1.001425
C  4.429269 0.447121 0.805922
C  1.685562 2.456393 -0.083031
C  1.278516 3.45687 -0.953164
C  0.79931 1.918014 0.844562
C  -0.026369 3.927119 -0.890976
C  -0.502368 2.394502 0.8902
C  -0.923908 3.395908 0.02406
H  -2.087044 -0.80736 1.222799
H  -1.417657 -1.28437 -1.756332
H  -3.72613 -1.704615 -2.104904
H  -4.750707 -2.484033 -0.901817
H  -3.603145 -3.440298 -1.836473
H  -2.014649 -3.18752 1.587034
H  -2.357181 -4.326452 0.28293
H  -3.675226 -3.54554 1.148743
H  -2.997349 0.516446 -1.396925
H  -5.688056 2.208564 -0.197995
H  -4.341583 2.379864 -1.329146
H  -4.319188 3.2111 0.228571
H  -3.709365 0.09069 2.278674
H  -5.300283 0.772853 1.973456
H  -3.9713 1.830503 2.380931
H  2.478761 -3.040192 -1.826952
H  2.041132 -3.567092 -0.207434
H  1.698021 -0.001881 -1.15091
H  4.246647 -2.935168 0.662639
H  5.639888 -1.127706 1.598438
H  5.016955 1.242422 1.245755
H  1.97798 3.865891 -1.671174
H  1.111092 1.13819 1.527802
H  -0.341103 4.707505 -1.571296
H  -1.191113 1.976179 1.613018
H  -1.942319 3.75946 0.064585
elementType: O C H
totalener: -1117.85661810 hartree
nucrepener: 2344.04893385 hartree
electener: -3461.90555196 hartree
oneelecener: -6178.15732727 hartree
twoeener: 2716.25177532 hartree
cpcmener: -0.03126387 hartree
kineticenergy: 1112.80777897 hartree
xcener: -110.232975793107 hartree
chargesum: 0.0000000
charge: -0.297510 -0.489215 -0.345526 0.141943 0.001174 -0.086971 -0.265944 -0.286723 -0.275060 0.391999 -0.050595 -0.247025 -0.263292 0.099261 0.029924 -0.220643 -0.236573 0.273411 -0.117217 -0.255902 0.298420 -0.248134 -0.192404 -0.134839 -0.163626 -0.190362 0.094332 0.092106 0.090734 0.097026 0.098706 0.090929 0.102473 0.096802 0.124634 0.106426 0.095909 0.092736 0.093014 0.107682 0.094738 0.126387 0.119333 0.146658 0.144965 0.161176 0.149250 0.147493 0.151097 0.159232 0.169969 0.177622
qa: -0.2975 -0.4892 -0.3455 0.1419 0.0012 -0.0870 -0.2659 -0.2867 -0.2751 0.3920 -0.0506 -0.2470 -0.2633 0.0993 0.0299 -0.2206 -0.2366 0.2734 -0.1172 -0.2559 0.2984 -0.2481 -0.1924 -0.1348 -0.1636 -0.1904 0.0943 0.0921 0.0907 0.0970 0.0987 0.0909 0.1025 0.0968 0.1246 0.1064 0.0959 0.0927 0.0930 0.1077 0.0947 0.1264 0.1193 0.1467 0.1450 0.1612 0.1492 0.1475 0.1511 0.1592 0.1700 0.1776
va: 2.1149 2.0014 2.0631 3.7442 3.7289 3.8541 3.9056 3.9036 3.7964 4.1390 3.7007 3.9177 3.9408 3.7867 3.6025 3.9151 3.9741 3.7137 3.8817 4.0194 3.6623 4.0076 3.8757 3.9164 3.8585 3.8655 1.0272 1.0385 1.0030 1.0025 1.0031 1.0179 0.9991 1.0008 1.0088 0.9987 1.0064 0.9941 1.0074 0.9985 0.9966 0.9916 1.0084 1.0155 1.0008 0.9873 1.0048 1.0071 1.0061 0.9895 0.9777 0.9768
dispcorr: -0.028469435 hartree
energy: -1117.885087539906
dipole: -30.91533 29.91401 -1.00132 -3.48379 3.02657 -0.45722 1.71096 -2.43240 -0.72144
magnitude: 1.31611 au
magnitude: 3.34530 debye
