program: Orca
programVersion: 5.0.2
elementType: O O O C C C C C C C C C C C C C C C C C C C C C C C H H H H H H H H H H H H H H H H H H H H H H H H H H
charge: 0
multiplicity: 1
keywords: wb97x-d3
keywords: def2-TZVPP
keywords: def2/J RIJCOSX
keywords: DEFGRID2
keywords: scfconv7
keywords: smallprint printgap noloewdin
keywords: NOSOSCF
formula: C23H26O3
InChI: InChI=1/C23H26O3/c1-16(2)13-20-21(23(20,3)4)22(24)25-15-17-9-8-12-19(14-17)26-18-10-6-5-7-11-18/h5-14,20-21H,15H2,1-4H3
52 atoms
O  0.167361 -2.460403 1.16675
O  -0.400922 -2.524372 -0.994645
O  1.714083 2.194021 0.323682
C  -2.646454 -0.622202 0.250597
C  -3.226829 -1.90911 -0.262121
C  -2.034234 -1.953106 0.66319
C  -3.36041 0.142129 1.337798
C  -1.930153 0.278276 -0.726027
C  -4.517906 -2.440987 0.220213
C  -0.706382 -2.346666 0.162369
C  -5.536725 -2.866308 -0.53376
C  -6.783743 -3.406148 0.099687
C  -5.552358 -2.863386 -2.03175
C  1.543288 -2.628626 0.822616
C  2.105494 -1.40573 0.15143
C  1.709272 -0.136915 0.559796
C  3.041009 -1.536568 -0.867423
C  2.221807 0.984813 -0.073094
C  3.563834 -0.404972 -1.477493
C  3.153183 0.863451 -1.097395
C  2.515426 3.308661 0.330607
C  3.801341 3.284543 0.856244
C  1.966567 4.487366 -0.152058
C  4.540873 4.457989 0.885053
C  2.714016 5.656174 -0.106054
C  4.004059 5.646087 0.405754
H  -2.991839 -2.110768 -1.301789
H  -2.226244 -2.234857 1.693175
H  -4.14631 0.767834 0.909914
H  -2.663158 0.799907 1.859869
H  -3.819802 -0.50665 2.082163
H  -1.156893 0.865504 -0.225584
H  -2.642031 0.981724 -1.16197
H  -1.46434 -0.26138 -1.548147
H  -4.635165 -2.494113 1.299014
H  -6.974451 -4.432099 -0.226102
H  -7.659086 -2.8222 -0.196027
H  -6.728352 -3.403823 1.188089
H  -4.680469 -2.391873 -2.48034
H  -6.43749 -2.339877 -2.40101
H  -5.617272 -3.883856 -2.418208
H  1.685727 -3.51403 0.200197
H  2.043733 -2.811542 1.77356
H  0.989487 -0.005914 1.35892
H  3.351425 -2.521271 -1.193672
H  4.284879 -0.509404 -2.277416
H  3.547159 1.735775 -1.602454
H  4.224351 2.366333 1.243944
H  0.961353 4.48998 -0.55406
H  5.542952 4.441165 1.293018
H  2.283898 6.575959 -0.479994
H  4.586268 6.55722 0.434974
elementType: O C H
totalener: -1117.85651653 hartree
nucrepener: 2214.53618160 hartree
electener: -3332.39269813 hartree
oneelecener: -5919.15308112 hartree
twoeener: 2586.76038299 hartree
cpcmener: -0.03154242 hartree
kineticenergy: 1112.80152799 hartree
xcener: -110.228867492160 hartree
chargesum: -0.0000000
charge: -0.293090 -0.484825 -0.342774 0.117979 0.040615 -0.093309 -0.272452 -0.279007 -0.291942 0.388254 -0.045588 -0.220476 -0.254207 0.102112 0.063431 -0.338798 -0.228570 0.320915 -0.126120 -0.213577 0.264155 -0.180201 -0.241871 -0.156458 -0.133514 -0.178060 0.089277 0.093401 0.098242 0.098843 0.090376 0.088239 0.105681 0.094164 0.121866 0.093721 0.094032 0.088631 0.090655 0.094666 0.098312 0.118038 0.123158 0.137094 0.144265 0.162338 0.159132 0.159145 0.149666 0.162163 0.160718 0.161556
qa: -0.2931 -0.4848 -0.3428 0.1180 0.0406 -0.0933 -0.2725 -0.2790 -0.2919 0.3883 -0.0456 -0.2205 -0.2542 0.1021 0.0634 -0.3388 -0.2286 0.3209 -0.1261 -0.2136 0.2642 -0.1802 -0.2419 -0.1565 -0.1335 -0.1781 0.0893 0.0934 0.0982 0.0988 0.0904 0.0882 0.1057 0.0942 0.1219 0.0937 0.0940 0.0886 0.0907 0.0947 0.0983 0.1180 0.1232 0.1371 0.1443 0.1623 0.1591 0.1591 0.1497 0.1622 0.1607 0.1616
va: 2.1081 2.0130 2.0347 3.6782 3.7896 3.8187 3.9033 3.8964 3.8727 4.1966 3.7469 3.9210 3.9423 3.7839 3.5813 4.0263 3.9806 3.6526 3.8935 3.9376 3.7003 3.9054 3.9983 3.8930 3.8861 3.8882 1.0344 1.0363 1.0017 1.0023 1.0049 1.0063 1.0022 1.0163 1.0093 0.9954 0.9966 1.0088 1.0091 0.9977 0.9960 1.0084 0.9938 1.0265 1.0027 0.9889 0.9956 0.9964 1.0058 0.9895 0.9887 0.9891
dispcorr: -0.024505423 hartree
energy: -1117.881021954051
dipole: -28.45291 28.71951 0.26660 -6.55319 6.97440 0.42121 -2.42776 3.10159 0.67383
magnitude: 0.83818 au
magnitude: 2.13048 debye
