program: Orca
programVersion: 5.0.2
elementType: O O O C C C C C C C C C C C C C C C C C C C C C C C H H H H H H H H H H H H H H H H H H H H H H H H H H
charge: 0
multiplicity: 1
keywords: wb97x-d3
keywords: def2-TZVPP
keywords: def2/J RIJCOSX
keywords: DEFGRID2
keywords: scfconv7
keywords: smallprint printgap noloewdin
keywords: NOSOSCF
formula: C23H26O3
InChI: InChI=1/C23H26O3/c1-16(2)13-20-21(23(20,3)4)22(24)25-15-17-9-8-12-19(14-17)26-18-10-6-5-7-11-18/h5-14,20-21H,15H2,1-4H3
52 atoms
O  0.691228 -2.272182 -1.363681
O  0.160246 -2.475166 0.796774
O  3.003696 2.091544 -0.074067
C  -2.774829 -2.430596 -0.353527
C  -2.436311 -1.073585 0.183105
C  -1.487518 -1.750085 -0.788485
C  -3.834501 -2.561953 -1.420032
C  -2.74505 -3.604539 0.593341
C  -3.133953 0.154201 -0.253082
C  -0.161247 -2.200311 -0.336912
C  -3.739393 1.044602 0.539146
C  -4.382608 2.270006 -0.036163
C  -3.830507 0.934451 2.029994
C  2.044091 -2.624879 -1.077937
C  2.771299 -1.557614 -0.308254
C  2.520292 -0.213083 -0.553263
C  3.731965 -1.91831 0.63034
C  3.215468 0.754249 0.158612
C  4.440182 -0.940394 1.312629
C  4.179275 0.404037 1.091201
C  1.715327 2.565282 -0.094464
C  0.735947 2.079841 0.76434
C  1.434382 3.597797 -0.978152
C  -0.533532 2.637692 0.726975
C  0.160516 4.148551 -1.000313
C  -0.830133 3.669244 -0.154315
H  -2.096294 -1.082134 1.213513
H  -1.503863 -1.366888 -1.802924
H  -3.712341 -3.500406 -1.96369
H  -3.803197 -1.752867 -2.148462
H  -4.829139 -2.567909 -0.969944
H  -3.746576 -3.769564 0.994955
H  -2.078392 -3.458185 1.439835
H  -2.445073 -4.51892 0.07781
H  -3.140706 0.343732 -1.322642
H  -3.955093 3.176545 0.400524
H  -5.451768 2.296496 0.190156
H  -4.264358 2.329041 -1.117845
H  -4.876476 0.935122 2.347234
H  -3.365694 1.799863 2.510115
H  -3.365478 0.037987 2.434802
H  2.501471 -2.764571 -2.057575
H  2.093693 -3.581136 -0.5534
H  1.783528 0.086433 -1.289375
H  3.923203 -2.965277 0.830397
H  5.186227 -1.224867 2.042661
H  4.713472 1.170968 1.637023
H  0.952472 1.280413 1.461464
H  2.206965 3.967596 -1.640356
H  -1.292447 2.262811 1.400891
H  -0.056195 4.953766 -1.689962
H  -1.823037 4.098255 -0.177211
elementType: O C H
totalener: -1117.85691392 hartree
nucrepener: 2331.54865993 hartree
electener: -3449.40557385 hartree
oneelecener: -6153.08333669 hartree
twoeener: 2703.67776284 hartree
cpcmener: -0.03175058 hartree
kineticenergy: 1112.80918273 hartree
xcener: -110.231813049723 hartree
chargesum: -0.0000000
charge: -0.298722 -0.496002 -0.347119 0.117482 0.044861 -0.095496 -0.266352 -0.283200 -0.273224 0.407495 -0.074959 -0.242272 -0.260504 0.107025 0.019942 -0.208260 -0.216244 0.242352 -0.123907 -0.237952 0.298084 -0.193857 -0.259544 -0.155118 -0.114194 -0.221355 0.096285 0.089508 0.098126 0.089699 0.097389 0.096558 0.091305 0.101129 0.122491 0.090487 0.108339 0.096427 0.106759 0.093376 0.093865 0.123452 0.117620 0.145341 0.145362 0.160625 0.149255 0.150716 0.147841 0.192150 0.160618 0.166320
qa: -0.2987 -0.4960 -0.3471 0.1175 0.0449 -0.0955 -0.2664 -0.2832 -0.2732 0.4075 -0.0750 -0.2423 -0.2605 0.1070 0.0199 -0.2083 -0.2162 0.2424 -0.1239 -0.2380 0.2981 -0.1939 -0.2595 -0.1551 -0.1142 -0.2214 0.0963 0.0895 0.0981 0.0897 0.0974 0.0966 0.0913 0.1011 0.1225 0.0905 0.1083 0.0964 0.1068 0.0934 0.0939 0.1235 0.1176 0.1453 0.1454 0.1606 0.1493 0.1507 0.1478 0.1921 0.1606 0.1663
va: 2.1126 1.9995 2.0544 3.7235 3.7238 3.8522 3.9076 3.9025 3.8052 4.1226 3.7457 3.9123 3.9371 3.7855 3.6126 3.9271 3.9572 3.7310 3.8895 4.0119 3.6605 3.8897 4.0137 3.8408 3.9057 3.9122 1.0278 1.0391 1.0025 1.0048 1.0021 1.0003 1.0191 0.9992 1.0103 0.9933 0.9993 1.0062 0.9978 0.9967 1.0084 0.9926 1.0089 1.0157 1.0017 0.9880 1.0043 1.0066 1.0074 0.9575 0.9884 0.9871
dispcorr: -0.027584852 hartree
energy: -1117.884498772857
dipole: -29.93955 29.00787 -0.93169 -3.22100 3.04053 -0.18048 2.09146 -2.79080 -0.69935
magnitude: 1.17885 au
magnitude: 2.99641 debye
