program: Orca
programVersion: 5.0.2
elementType: O O O C C C C C C C C C C C C C C C C C C C C C C C H H H H H H H H H H H H H H H H H H H H H H H H H H
charge: 0
multiplicity: 1
keywords: wb97x-d3
keywords: def2-TZVPP
keywords: def2/J RIJCOSX
keywords: DEFGRID2
keywords: scfconv7
keywords: smallprint printgap noloewdin
keywords: NOSOSCF
formula: C23H26O3
InChI: InChI=1/C23H26O3/c1-16(2)13-20-21(23(20,3)4)22(24)25-15-17-9-8-12-19(14-17)26-18-10-6-5-7-11-18/h5-14,20-21H,15H2,1-4H3
52 atoms
O  -0.056901 -2.616001 0.694193
O  -0.395865 -1.956943 -1.415245
O  2.456432 1.659942 1.325244
C  -2.411115 -0.070136 0.207902
C  -3.136482 -1.033758 -0.67099
C  -2.065981 -1.555483 0.25522
C  -3.097601 0.467852 1.438591
C  -1.455495 0.916834 -0.418734
C  -4.557409 -1.402576 -0.433854
C  -0.785317 -2.049075 -0.273198
C  -5.06395 -2.62869 -0.586757
C  -6.512709 -2.91306 -0.333725
C  -4.249774 -3.811381 -1.013183
C  1.292326 -2.961647 0.381488
C  2.135836 -1.746196 0.11258
C  1.917908 -0.568663 0.820114
C  3.144878 -1.794803 -0.840569
C  2.701313 0.544761 0.565128
C  3.936499 -0.677892 -1.072118
C  3.723447 0.500979 -0.375094
C  2.433342 2.900392 0.741606
C  1.935852 3.117059 -0.538147
C  2.880476 3.961706 1.517036
C  1.902469 4.411095 -1.039339
C  2.829655 5.250349 1.006383
C  2.347249 5.481493 -0.274878
H  -2.837046 -0.995443 -1.716278
H  -2.405489 -2.065239 1.150165
H  -2.359616 0.77744 2.18077
H  -3.750722 -0.267354 1.908698
H  -3.702711 1.342615 1.191466
H  -0.662067 1.193154 0.279147
H  -1.993345 1.830583 -0.679307
H  -0.99082 0.544864 -1.329994
H  -5.225783 -0.600679 -0.132173
H  -7.054653 -2.028705 0.000625
H  -6.62901 -3.689419 0.426832
H  -7.002156 -3.289908 -1.235247
H  -4.240737 -4.576047 -0.232023
H  -3.217688 -3.562901 -1.252173
H  -4.692146 -4.280861 -1.895345
H  1.33412 -3.657628 -0.458766
H  1.651516 -3.489644 1.265114
H  1.135889 -0.500272 1.56682
H  3.310162 -2.70302 -1.406428
H  4.726077 -0.721892 -1.810703
H  4.344273 1.367216 -0.56463
H  1.572277 2.29527 -1.142242
H  3.260781 3.77807 2.513917
H  1.517326 4.5800 -2.036492
H  3.176908 6.075453 1.614298
H  2.314928 6.486741 -0.672952
elementType: O C H
totalener: -1117.85480748 hartree
nucrepener: 2266.70692144 hartree
electener: -3384.56172892 hartree
oneelecener: -6023.36260400 hartree
twoeener: 2638.80087508 hartree
cpcmener: -0.02961167 hartree
kineticenergy: 1112.80294785 hartree
xcener: -110.228875612180 hartree
chargesum: 0.0000000
charge: -0.296023 -0.488601 -0.344761 0.171649 -0.007825 -0.120356 -0.288090 -0.292168 -0.304645 0.394207 -0.018071 -0.229566 -0.238911 0.102641 0.044935 -0.308878 -0.218352 0.282124 -0.129784 -0.196800 0.321124 -0.203796 -0.260943 -0.164706 -0.126885 -0.186772 0.104030 0.099559 0.098683 0.094930 0.099603 0.086020 0.106343 0.096951 0.124275 0.090354 0.094244 0.097047 0.099810 0.079363 0.101719 0.118052 0.123144 0.138733 0.145319 0.162513 0.158850 0.157204 0.147777 0.162045 0.161338 0.161350
qa: -0.2960 -0.4886 -0.3448 0.1716 -0.0078 -0.1204 -0.2881 -0.2922 -0.3046 0.3942 -0.0181 -0.2296 -0.2389 0.1026 0.0449 -0.3089 -0.2184 0.2821 -0.1298 -0.1968 0.3211 -0.2038 -0.2609 -0.1647 -0.1269 -0.1868 0.1040 0.0996 0.0987 0.0949 0.0996 0.0860 0.1063 0.0970 0.1243 0.0904 0.0942 0.0970 0.0998 0.0794 0.1017 0.1181 0.1231 0.1387 0.1453 0.1625 0.1589 0.1572 0.1478 0.1620 0.1613 0.1614
va: 2.1051 2.0046 2.0394 3.7000 3.8275 3.8113 3.9020 3.8860 3.8907 4.1489 3.7116 3.9299 3.9315 3.7837 3.6033 4.0161 3.9733 3.7125 3.8871 3.9270 3.6230 3.8823 4.0136 3.9122 3.8842 3.8980 1.0244 1.0300 1.0035 1.0018 1.0000 1.0023 1.0035 1.0145 1.0029 1.0059 0.9966 0.9959 0.9986 1.0163 0.9996 1.0084 0.9934 1.0253 1.0021 0.9887 0.9949 0.9967 1.0082 0.9899 0.9880 0.9891
dispcorr: -0.026389288 hartree
energy: -1117.881196769616
dipole: -26.74137 26.52902 -0.21235 -5.77158 5.70340 -0.06818 -2.11554 2.55626 0.44073
magnitude: 0.49395 au
magnitude: 1.25551 debye
