program: Orca
programVersion: 5.0.2
elementType: O O O C C C C C C C C C C C C C C C C C C C C C C C H H H H H H H H H H H H H H H H H H H H H H H H H H
charge: 0
multiplicity: 1
keywords: wb97x-d3
keywords: def2-TZVPP
keywords: def2/J RIJCOSX
keywords: DEFGRID2
keywords: scfconv7
keywords: smallprint printgap noloewdin
keywords: NOSOSCF
formula: C23H26O3
InChI: InChI=1/C23H26O3/c1-16(2)13-20-21(23(20,3)4)22(24)25-15-17-9-8-12-19(14-17)26-18-10-6-5-7-11-18/h5-14,20-21H,15H2,1-4H3
52 atoms
O  0.241871 -2.807553 0.65143
O  -0.325795 -2.063555 -1.378748
O  2.654891 1.544552 1.362977
C  -2.303917 -0.411304 0.488169
C  -3.048985 -1.395687 -0.365799
C  -1.863609 -1.867225 0.447923
C  -2.893836 0.059957 1.795046
C  -1.482835 0.655921 -0.194306
C  -4.398755 -1.880186 -0.01956
C  -0.605939 -2.246707 -0.216146
C  -5.405788 -2.118223 -0.866814
C  -6.734263 -2.592655 -0.358809
C  -5.340994 -1.93519 -2.352891
C  1.572543 -3.057643 0.198892
C  2.33401 -1.786269 -0.056502
C  2.135168 -0.668322 0.748026
C  3.257578 -1.727201 -1.092258
C  2.856028 0.489513 0.507364
C  3.983182 -0.564347 -1.314072
C  3.787829 0.555071 -0.521033
C  2.4550 2.800784 0.848578
C  1.704597 3.021025 -0.300615
C  2.990052 3.864904 1.561378
C  1.496056 4.324066 -0.731162
C  2.765225 5.162004 1.123149
C  2.022533 5.398224 -0.025811
H  -2.843154 -1.295637 -1.426066
H  -2.081242 -2.427073 1.351047
H  -2.105351 0.440035 2.447022
H  -3.413744 -0.726697 2.339156
H  -3.601222 0.873747 1.624922
H  -0.630219 0.946293 0.42368
H  -2.09535 1.547089 -0.343036
H  -1.106708 0.356526 -1.170332
H  -4.583027 -2.059478 1.03567
H  -6.988994 -3.568729 -0.779964
H  -7.5340 -1.910412 -0.658849
H  -6.754106 -2.677833 0.727473
H  -4.33867 -1.739149 -2.730078
H  -5.97965 -1.104716 -2.666931
H  -5.719683 -2.823154 -2.864553
H  1.571224 -3.693514 -0.68843
H  2.034883 -3.623407 1.00776
H  1.420958 -0.683791 1.562605
H  3.407627 -2.588397 -1.731254
H  4.70445 -0.525241 -2.11965
H  4.354862 1.459772 -0.700369
H  1.278081 2.193759 -0.854811
H  3.572503 3.677959 2.454622
H  0.910689 4.496709 -1.624763
H  3.181558 5.99005 1.681811
H  1.85344 6.410493 -0.367583
elementType: O C H
totalener: -1117.85661782 hartree
nucrepener: 2250.11265902 hartree
electener: -3367.96927684 hartree
oneelecener: -5990.12867734 hartree
twoeener: 2622.15940050 hartree
cpcmener: -0.03091115 hartree
kineticenergy: 1112.79378236 hartree
xcener: -110.227628483291 hartree
chargesum: -0.0000000
charge: -0.294704 -0.486070 -0.345932 0.122264 0.021961 -0.075181 -0.279474 -0.285664 -0.282563 0.388871 -0.050911 -0.218519 -0.255126 0.101272 0.043830 -0.302431 -0.213760 0.263642 -0.136168 -0.177672 0.294939 -0.186448 -0.246067 -0.175688 -0.131662 -0.181971 0.095085 0.092861 0.098839 0.091237 0.099292 0.086891 0.106366 0.097845 0.120684 0.094170 0.092674 0.088516 0.091521 0.100203 0.093547 0.118410 0.123268 0.138033 0.145723 0.162341 0.159412 0.160187 0.147495 0.161759 0.161046 0.161823
qa: -0.2947 -0.4861 -0.3459 0.1223 0.0220 -0.0752 -0.2795 -0.2857 -0.2826 0.3889 -0.0509 -0.2185 -0.2551 0.1013 0.0438 -0.3024 -0.2138 0.2636 -0.1362 -0.1777 0.2949 -0.1864 -0.2461 -0.1757 -0.1317 -0.1820 0.0951 0.0929 0.0988 0.0912 0.0993 0.0869 0.1064 0.0978 0.1207 0.0942 0.0927 0.0885 0.0915 0.1002 0.0935 0.1184 0.1233 0.1380 0.1457 0.1623 0.1594 0.1602 0.1475 0.1618 0.1610 0.1618
va: 2.1092 2.0120 2.0379 3.6850 3.8217 3.7893 3.9070 3.8975 3.8816 4.2005 3.7614 3.9202 3.9378 3.7842 3.6062 4.0094 3.9684 3.7259 3.8915 3.9202 3.6471 3.8676 4.0047 3.9266 3.8894 3.8921 1.0270 1.0345 1.0018 1.0067 1.0011 1.0010 1.0024 1.0157 1.0104 0.9966 0.9954 1.0087 1.0107 0.9957 0.9973 1.0090 0.9934 1.0257 1.0019 0.9889 0.9949 0.9931 1.0079 0.9905 0.9880 0.9887
dispcorr: -0.025399596 hartree
energy: -1117.882017416568
dipole: -29.55323 29.29747 -0.25576 -2.40683 2.54169 0.13486 -3.64887 3.96174 0.31287
magnitude: 0.42602 au
magnitude: 1.08285 debye
