program: Orca
programVersion: 5.0.2
elementType: O O O C C C C C C C C C C C C C C C C C C C C C C C H H H H H H H H H H H H H H H H H H H H H H H H H H
charge: 0
multiplicity: 1
keywords: wb97x-d3
keywords: def2-TZVPP
keywords: def2/J RIJCOSX
keywords: DEFGRID2
keywords: scfconv7
keywords: smallprint printgap noloewdin
keywords: NOSOSCF
formula: C23H26O3
InChI: InChI=1/C23H26O3/c1-16(2)13-20-21(23(20,3)4)22(24)25-15-17-9-8-12-19(14-17)26-18-10-6-5-7-11-18/h5-14,20-21H,15H2,1-4H3
52 atoms
O  0.727738 -2.56407 -1.164456
O  0.233166 -2.209517 0.986184
O  2.721943 2.013154 -0.493382
C  -2.731417 -2.254516 -0.086672
C  -2.277661 -0.83486 0.050839
C  -1.416176 -1.821748 -0.712611
C  -3.83867 -2.573746 -1.060093
C  -2.753095 -3.129706 1.140737
C  -2.905092 0.282669 -0.692303
C  -0.102647 -2.21186 -0.176312
C  -3.647215 1.255632 -0.155495
C  -4.200996 2.360092 -1.002806
C  -3.994808 1.341231 1.298096
C  2.080778 -2.852581 -0.827952
C  2.844608 -1.640054 -0.368673
C  2.423465 -0.354525 -0.677197
C  4.014754 -1.817766 0.364368
C  3.144634 0.735155 -0.210101
C  4.74847 -0.720618 0.786752
C  4.310245 0.569325 0.516694
C  1.479048 2.406934 -0.068136
C  0.904753 3.477076 -0.742841
C  0.821768 1.814287 1.004848
C  -0.328063 3.962551 -0.333142
C  -0.41426 2.309163 1.398136
C  -0.994632 3.38256 0.737468
H  -1.899653 -0.587461 1.038551
H  -1.443051 -1.728993 -1.79278
H  -3.776316 -1.98851 -1.976256
H  -4.810738 -2.376737 -0.604737
H  -3.812433 -3.628614 -1.337694
H  -2.553407 -4.171439 0.883948
H  -3.744668 -3.089146 1.594932
H  -2.037239 -2.823368 1.899344
H  -2.735705 0.304158 -1.764818
H  -3.918113 2.256917 -2.049935
H  -3.847576 3.333334 -0.652447
H  -5.291956 2.390155 -0.947386
H  -3.549603 0.551593 1.900367
H  -5.07846 1.285202 1.430691
H  -3.686343 2.301791 1.71742
H  2.514755 -3.248051 -1.746195
H  2.134559 -3.642253 -0.075775
H  1.52906 -0.180958 -1.263338
H  4.348943 -2.818252 0.610105
H  5.657179 -0.866879 1.355081
H  4.862344 1.430349 0.870374
H  1.423798 3.927552 -1.579333
H  1.256961 0.979658 1.539057
H  -0.770903 4.796773 -0.86122
H  -0.923317 1.846782 2.234091
H  -1.957202 3.762574 1.052152
elementType: O C H
totalener: -1117.85644351 hartree
nucrepener: 2359.08741146 hartree
electener: -3476.94385497 hartree
oneelecener: -6208.38321145 hartree
twoeener: 2731.43935648 hartree
cpcmener: -0.03205329 hartree
kineticenergy: 1112.81596173 hartree
xcener: -110.234704871599 hartree
chargesum: 0.0000000
charge: -0.299342 -0.489562 -0.344293 0.159327 -0.007979 -0.082247 -0.266572 -0.294888 -0.254204 0.381426 -0.057360 -0.230786 -0.268535 0.098369 0.023832 -0.214789 -0.219557 0.245909 -0.130312 -0.223313 0.305488 -0.246985 -0.187663 -0.122730 -0.182134 -0.196191 0.093877 0.090915 0.091158 0.096525 0.098856 0.101685 0.095511 0.091340 0.123168 0.092442 0.086546 0.102399 0.095063 0.111778 0.093276 0.126976 0.118901 0.148702 0.146224 0.161581 0.150163 0.146762 0.149480 0.159098 0.164723 0.167942
qa: -0.2993 -0.4896 -0.3443 0.1593 -0.0080 -0.0822 -0.2666 -0.2949 -0.2542 0.3814 -0.0574 -0.2308 -0.2685 0.0984 0.0238 -0.2148 -0.2196 0.2459 -0.1303 -0.2233 0.3055 -0.2470 -0.1877 -0.1227 -0.1821 -0.1962 0.0939 0.0909 0.0912 0.0965 0.0989 0.1017 0.0955 0.0913 0.1232 0.0924 0.0865 0.1024 0.0951 0.1118 0.0933 0.1270 0.1189 0.1487 0.1462 0.1616 0.1502 0.1468 0.1495 0.1591 0.1647 0.1679
va: 2.1132 1.9995 2.0611 3.7429 3.7341 3.8871 3.9059 3.8995 3.7871 4.1315 3.7277 3.9146 3.9354 3.7880 3.6081 3.9521 3.9646 3.7258 3.8818 4.0084 3.6658 4.0036 3.8523 3.9045 3.8731 3.8544 1.0213 1.0394 1.0028 1.0030 1.0029 0.9991 1.0009 1.0192 1.0076 1.0070 0.9978 0.9979 1.0054 1.0006 0.9980 0.9921 1.0088 1.0126 0.9999 0.9877 1.0029 1.0078 1.0075 0.9898 0.9889 0.9813
dispcorr: -0.029180538 hartree
energy: -1117.885624045979
dipole: -29.54922 28.72058 -0.82864 -1.76903 1.31741 -0.45162 1.86503 -2.39246 -0.52743
magnitude: 1.08111 au
magnitude: 2.74796 debye
